List of SWMF_TEST_RESULTS/2020/09/03's difference files for gfortran
-rw-r--r-- 1 gtoth 1410742483 0 Sep 3 23:16 share/Library/test/test_axes.diff
-rw-r--r-- 1 gtoth 1410742483 0 Sep 3 23:16 share/Library/test/test_coord_transform.diff
-rw-r--r-- 1 gtoth 1410742483 0 Sep 3 23:16 share/Library/test/test_freq.diff
-rw-r--r-- 1 gtoth 1410742483 0 Sep 3 23:16 share/Library/test/test_geopack.diff
-rw-r--r-- 1 gtoth 1410742483 0 Sep 3 23:16 share/Library/test/test_io_unit.diff
-rw-r--r-- 1 gtoth 1410742483 0 Sep 3 23:16 share/Library/test/test_interpolate.diff
-rw-r--r-- 1 gtoth 1410742483 0 Sep 3 23:16 share/Library/test/test_interpolate_amr.diff
-rw-r--r-- 1 gtoth 1410742483 59 Sep 3 23:17 share/Library/test/test_initial_state.diff
-rw-r--r-- 1 gtoth 1410742483 116 Sep 3 23:17 share/Library/test/test_line_extract.diff
-rw-r--r-- 1 gtoth 1410742483 0 Sep 3 23:17 share/Library/test/test_linear_advection.diff
-rw-r--r-- 1 gtoth 1410742483 0 Sep 3 23:17 share/Library/test/test_linear_solver.diff
-rw-r--r-- 1 gtoth 1410742483 0 Sep 3 23:17 share/Library/test/test_linear_wrapper.diff
-rw-r--r-- 1 gtoth 1410742483 856 Sep 3 23:17 share/Library/test/test_lookup_table.diff
-rw-r--r-- 1 gtoth 1410742483 0 Sep 3 23:17 share/Library/test/test_planet_field.diff
-rw-r--r-- 1 gtoth 1410742483 0 Sep 3 23:17 share/Library/test/test_plot_file.diff
-rw-r--r-- 1 gtoth 1410742483 0 Sep 3 23:17 share/Library/test/test_poisson.diff
-rw-r--r-- 1 gtoth 1410742483 0 Sep 3 23:17 share/Library/test/test_random_number.diff
-rw-r--r-- 1 gtoth 1410742483 69 Sep 3 23:17 share/Library/test/test_ray_trace.diff
-rw-r--r-- 1 gtoth 1410742483 0 Sep 3 23:17 share/Library/test/test_sort.diff
-rw-r--r-- 1 gtoth 1410742483 0 Sep 3 23:17 share/Library/test/test_time_convert.diff
-rw-r--r-- 1 gtoth 1410742483 0 Sep 3 23:17 share/Library/test/test_triangulate.diff
-rw-r--r-- 1 gtoth 1410742483 5404 Sep 3 23:20 share/Library/test/test_process_var_name.diff
-rw-r--r-- 1 gtoth 1410742483 0 Sep 3 23:20 share/Library/test/test_utilities.diff
-rw-r--r-- 1 gtoth 1410742483 0 Sep 3 23:20 util/DATAREAD/srcMagnetogram/test_harmonics.diff
-rw-r--r-- 1 gtoth 1410742483 0 Sep 3 23:20 util/DATAREAD/srcMagnetogram/test_potential.diff
-rw-r--r-- 1 gtoth 1410742483 40 Sep 3 23:20 util/DATAREAD/srcMagnetogram/test_fdips.diff
-rw-r--r-- 1 gtoth 1410742483 28 Sep 3 23:22 util/DATAREAD/srcMagnetogram/test_fdips_hypre.diff
-rw-r--r-- 1 gtoth 1410742483 52 Sep 3 23:22 util/DATAREAD/srcMagnetogram/test_fdips_wedge.diff
-rw-r--r-- 1 gtoth 1410742483 68 Sep 3 23:22 BATL/test11.diff
-rw-r--r-- 1 gtoth 1410742483 68 Sep 3 23:22 BATL/test12.diff
-rw-r--r-- 1 gtoth 1410742483 68 Sep 3 23:22 BATL/test21.diff
-rw-r--r-- 1 gtoth 1410742483 68 Sep 3 23:23 BATL/test22.diff
-rw-r--r-- 1 gtoth 1410742483 68 Sep 3 23:23 BATL/test31.diff
-rw-r--r-- 1 gtoth 1410742483 68 Sep 3 23:23 BATL/test32.diff
-rw-r--r-- 1 gtoth 1410742483 68 Sep 3 23:23 BATL/test33.diff
-rw-r--r-- 1 gtoth 1410742483 53 Sep 3 23:24 BATL/advect11.diff
-rw-r--r-- 1 gtoth 1410742483 53 Sep 3 23:24 BATL/advect21.diff
-rw-r--r-- 1 gtoth 1410742483 53 Sep 3 23:24 BATL/advect22.diff
-rw-r--r-- 1 gtoth 1410742483 53 Sep 3 23:24 BATL/advect12.diff
-rw-r--r-- 1 gtoth 1410742483 53 Sep 3 23:24 BATL/advect31.diff
-rw-r--r-- 1 gtoth 1410742483 53 Sep 3 23:24 BATL/advect32.diff
-rw-r--r-- 1 gtoth 1410742483 53 Sep 3 23:25 BATL/advect33.diff
-rw-r--r-- 1 gtoth 1410742483 56 Sep 3 23:25 BATL/advect22_rz.diff
-rw-r--r-- 1 gtoth 1410742483 57 Sep 3 23:25 BATL/advect22_cyl.diff
-rw-r--r-- 1 gtoth 1410742483 59 Sep 3 23:25 BATL/advect22_round.diff
-rw-r--r-- 1 gtoth 1410742483 57 Sep 3 23:25 BATL/advect33_sph.diff
-rw-r--r-- 1 gtoth 1410742483 61 Sep 3 23:25 BATL/advect33_rlonlat.diff
-rw-r--r-- 1 gtoth 1410742483 59 Sep 3 23:25 BATL/advect33_round.diff
-rw-r--r-- 1 gtoth 1410742483 72 Sep 3 23:25 BATL/readamr_1d.diff
-rw-r--r-- 1 gtoth 1410742483 72 Sep 3 23:26 BATL/readamr_2d.diff
-rw-r--r-- 1 gtoth 1410742483 72 Sep 3 23:26 BATL/readamr_3d.diff
-rw-r--r-- 1 gtoth 1410742483 73 Sep 3 23:27 BATL/readamr_sph.diff
-rw-r--r-- 1 gtoth 1410742483 0 Sep 3 23:28 BATL/readamr_c.diff
-rw-r--r-- 1 gtoth 1410742483 0 Sep 3 23:28 BATL/readamr_py.diff
-rw-r--r-- 1 gtoth 1410742483 28 Sep 3 23:29 CZ/FSAM/test_fsam.diff
-rw-r--r-- 1 gtoth 1410742483 79 Sep 3 23:29 GM/BATSRUS/test_awsomoxygen.diff
-rw-r--r-- 1 gtoth 1410742483 48 Sep 3 23:30 GM/BATSRUS/test_spectrum2.diff
-rw-r--r-- 1 gtoth 1410742483 46 Sep 3 23:30 GM/BATSRUS/test_spectrum.diff
-rw-r--r-- 1 gtoth 1410742483 85 Sep 3 23:31 GM/BATSRUS/test_fluxemergence.diff
-rw-r--r-- 1 gtoth 1410742483 73 Sep 3 23:32 GM/BATSRUS/test_shocktube.diff
-rw-r--r-- 1 gtoth 1410742483 73 Sep 3 23:33 GM/BATSRUS/test_shockramp.diff
-rw-r--r-- 1 gtoth 1410742483 76 Sep 3 23:33 GM/BATSRUS/test_partsteady.diff
-rw-r--r-- 1 gtoth 1410742483 67 Sep 3 23:35 GM/BATSRUS/test_hallmhd.diff
-rw-r--r-- 1 gtoth 1410742483 79 Sep 3 23:36 GM/BATSRUS/test_twofluidmhd.diff
-rw-r--r-- 1 gtoth 1410742483 76 Sep 3 23:36 GM/BATSRUS/test_multifluid.diff
-rw-r--r-- 1 gtoth 1410742483 70 Sep 3 23:37 GM/BATSRUS/test_multiion.diff
-rw-r--r-- 1 gtoth 1410742483 67 Sep 3 23:37 GM/BATSRUS/test_mhdions.diff
-rw-r--r-- 1 gtoth 1410742483 76 Sep 3 23:38 GM/BATSRUS/test_mhdnoncons.diff
-rw-r--r-- 1 gtoth 1410742483 76 Sep 3 23:39 GM/BATSRUS/test_eosgodunov.diff
-rw-r--r-- 1 gtoth 1410742483 29 Sep 3 23:39 GM/BATSRUS/test_laserpackage.diff
-rw-r--r-- 1 gtoth 1410742483 85 Sep 3 23:40 GM/BATSRUS/test_graydiffusion.diff
-rw-r--r-- 1 gtoth 1410742483 73 Sep 3 23:41 GM/BATSRUS/test_viscosity.diff
-rw-r--r-- 1 gtoth 1410742483 73 Sep 3 23:42 GM/BATSRUS/test_coronasph.diff
-rw-r--r-- 1 gtoth 1410742483 79 Sep 3 23:43 GM/BATSRUS/test_awsomfluids.diff
-rw-r--r-- 1 gtoth 1410742483 64 Sep 3 23:44 GM/BATSRUS/test_chromo.diff
-rw-r--r-- 1 gtoth 1410742483 82 Sep 3 23:45 GM/BATSRUS/test_outerhelio2d.diff
-rw-r--r-- 1 gtoth 1410742483 76 Sep 3 23:46 GM/BATSRUS/test_outerhelio.diff
-rw-r--r-- 1 gtoth 1410742483 85 Sep 3 23:47 GM/BATSRUS/test_outerheliopui.diff
-rw-r--r-- 1 gtoth 1410742483 94 Sep 3 23:47 GM/BATSRUS/test_outerheliopui_1d.diff
-rw-r--r-- 1 gtoth 1410742483 70 Sep 3 23:48 GM/BATSRUS/test_earthsph.diff
-rw-r--r-- 1 gtoth 1410742483 73 Sep 3 23:49 GM/BATSRUS/test_2bodyplot.diff
-rw-r--r-- 1 gtoth 1410742483 61 Sep 3 23:50 GM/BATSRUS/test_titan.diff
-rw-r--r-- 1 gtoth 1410742483 27 Sep 3 23:50 GM/BATSRUS/test_titan_restart.diff
-rw-r--r-- 1 gtoth 1410742483 58 Sep 3 23:51 GM/BATSRUS/test_mars.diff
-rw-r--r-- 1 gtoth 1410742483 26 Sep 3 23:51 GM/BATSRUS/test_mars_restart.diff
-rw-r--r-- 1 gtoth 1410742483 76 Sep 3 23:51 GM/BATSRUS/test_marsfluids.diff
-rw-r--r-- 1 gtoth 1410742483 32 Sep 3 23:51 GM/BATSRUS/test_marsfluids_restart.diff
-rw-r--r-- 1 gtoth 1410742483 61 Sep 3 23:52 GM/BATSRUS/test_venus.diff
-rw-r--r-- 1 gtoth 1410742483 27 Sep 3 23:52 GM/BATSRUS/test_venus_restart.diff
-rw-r--r-- 1 gtoth 1410742483 76 Sep 3 23:53 GM/BATSRUS/test_mercurysph.diff
-rw-r--r-- 1 gtoth 1410742483 70 Sep 3 23:54 GM/BATSRUS/test_ganymede.diff
-rw-r--r-- 1 gtoth 1410742483 64 Sep 3 23:55 GM/BATSRUS/test_saturn.diff
-rw-r--r-- 1 gtoth 1410742483 61 Sep 3 23:56 GM/BATSRUS/test_comet.diff
-rw-r--r-- 1 gtoth 1410742483 79 Sep 3 23:57 GM/BATSRUS/test_cometfluids.diff
-rw-r--r-- 1 gtoth 1410742483 33 Sep 3 23:57 GM/BATSRUS/test_cometfluids_restart.diff
-rw-r--r-- 1 gtoth 1410742483 73 Sep 3 23:58 GM/BATSRUS/test_cometCGhd.diff
-rw-r--r-- 1 gtoth 1410742483 85 Sep 3 23:59 GM/BATSRUS/test_cometCGfluids.diff
-rw-r--r-- 1 gtoth 1410742483 91 Sep 3 23:59 GM/BATSRUS/test_europa2fluidspe.diff
-rw-r--r-- 1 gtoth 1410742483 91 Sep 4 00:00 GM/BATSRUS/test_europa3fluidspe.diff
-rw-r--r-- 1 gtoth 1410742483 82 Sep 4 00:01 GM/BATSRUS/test_magnetometer.diff
-rw-r--r-- 1 gtoth 1410742483 79 Sep 4 00:02 GM/BATSRUS/test_anisotropic.diff
-rw-r--r-- 1 gtoth 1410742483 70 Sep 4 00:02 GM/BATSRUS/test_region2d.diff
-rw-r--r-- 1 gtoth 1410742483 97 Sep 4 00:03 GM/BATSRUS/test_fivemoment_alfven.diff
-rw-r--r-- 1 gtoth 1410742483 94 Sep 4 00:04 GM/BATSRUS/test_fivemoment_shock.diff
-rw-r--r-- 1 gtoth 1410742483 103 Sep 4 00:04 GM/BATSRUS/test_fivemoment_langmuir.diff
-rw-r--r-- 1 gtoth 1410742483 16414 Sep 4 00:05 GM/BATSRUS/test_func.diff
-rw-r--r-- 1 gtoth 1410742483 36 Sep 4 00:06 IE/Ridley_serial/notest.diff
-rw-r--r-- 1 gtoth 1410742483 76 Sep 4 00:06 IM/CIMI2/test_cimi.diff
-rw-r--r-- 1 gtoth 1410742483 43 Sep 4 00:06 IM/HEIDI/test_analytic.diff
-rw-r--r-- 1 gtoth 1410742483 43 Sep 4 00:06 IM/HEIDI/test_numeric.diff
-rw-r--r-- 1 gtoth 1410742483 26 Sep 4 00:06 IM/RCM2/notest.diff
-rw-r--r-- 1 gtoth 1410742483 68 Sep 4 00:07 PC/ALTOR/test_altor.diff
-rw-r--r-- 1 gtoth 1410742483 68 Sep 4 00:07 PC/ALTOR/test_altor_2d.diff
-rw-r--r-- 1 gtoth 1410742483 68 Sep 4 00:08 PC/ALTOR/test_beam.diff
-rw-r--r-- 1 gtoth 1410742483 58 Sep 4 00:08 PC/ALTOR/test_foil.diff
-rw-r--r-- 1 gtoth 1410742483 43 Sep 4 00:08 PC/IPIC3D2/test_ipic3d.diff
-rw-r--r-- 1 gtoth 1410742483 28 Sep 4 00:08 PS/DGCPM/notest.diff
-rw-r--r-- 1 gtoth 1410742483 12 Sep 4 00:08 PW/PWOM/test_Saturn_plots.diff
-rw-r--r-- 1 gtoth 1410742483 43 Sep 4 00:09 PW/PWOM/test_Saturn.diff
-rw-r--r-- 1 gtoth 1410742483 21 Sep 4 00:09 PW/PWOM/test_Saturn_restart.diff
-rw-r--r-- 1 gtoth 1410742483 12 Sep 4 00:09 PW/PWOM/test_Earth_plots.diff
-rw-r--r-- 1 gtoth 1410742483 43 Sep 4 00:09 PW/PWOM/test_Earth.diff
-rw-r--r-- 1 gtoth 1410742483 21 Sep 4 00:09 PW/PWOM/test_Earth_restart.diff
-rw-r--r-- 1 gtoth 1410742483 0 Sep 4 00:10 RB/RBE/test.diff
-rw-r--r-- 1 gtoth 1410742483 27 Sep 4 00:10 SP/Kota/notest.diff
-rw-r--r-- 1 gtoth 1410742483 89 Sep 4 00:10 SP/MFLAMPA/test_mflampa.diff
-rw-r--r-- 1 gtoth 1410742483 85 Sep 4 00:11 UA/GITM2/test_gitm_earth_1d.diff
-rw-r--r-- 1 gtoth 1410742483 82 Sep 4 00:12 UA/GITM2/test_gitm_mars_1d.diff
-rw-r--r-- 1 gtoth 1410742483 64 Sep 4 00:12 test_ps.diff
-rw-r--r-- 1 gtoth 1410742483 52 Sep 4 00:12 test_sp.diff
-rw-r--r-- 1 gtoth 1410742483 58 Sep 4 00:14 test_swpc_gm.diff
-rw-r--r-- 1 gtoth 1410742483 58 Sep 4 00:14 test_swpc_ie.diff
-rw-r--r-- 1 gtoth 1410742483 58 Sep 4 00:14 test_swpc_rb.diff
-rw-r--r-- 1 gtoth 1410742483 85 Sep 4 00:16 test_swpc_multiion_gm.diff
-rw-r--r-- 1 gtoth 1410742483 85 Sep 4 00:16 test_swpc_multiion_ie.diff
-rw-r--r-- 1 gtoth 1410742483 97 Sep 4 00:17 test_swpc_multispecies_gm.diff
-rw-r--r-- 1 gtoth 1410742483 97 Sep 4 00:17 test_swpc_multispecies_ie.diff
-rw-r--r-- 1 gtoth 1410742483 73 Sep 4 00:18 test_swpc_cimi_gm.diff
-rw-r--r-- 1 gtoth 1410742483 73 Sep 4 00:18 test_swpc_cimi_ie.diff
-rw-r--r-- 1 gtoth 1410742483 46 Sep 4 00:20 test01_gm.diff
-rw-r--r-- 1 gtoth 1410742483 46 Sep 4 00:20 test01_ie.diff
-rw-r--r-- 1 gtoth 1410742483 46 Sep 4 00:20 test01_pw.diff
-rw-r--r-- 1 gtoth 1410742483 46 Sep 4 00:20 test04_gm.diff
-rw-r--r-- 1 gtoth 1410742483 46 Sep 4 00:20 test04_ie.diff
-rw-r--r-- 1 gtoth 1410742483 46 Sep 4 00:20 test04_im_heidi.diff
-rw-r--r-- 1 gtoth 1410742483 45 Sep 4 00:23 test05_ee.diff
-rw-r--r-- 1 gtoth 1410742483 46 Sep 4 00:26 test07_ih.diff
-rw-r--r-- 1 gtoth 1410742483 46 Sep 4 00:26 test07_oh.diff
-rw-r--r-- 1 gtoth 1410742483 46 Sep 4 00:28 test08_sc_thread.diff
-rw-r--r-- 1 gtoth 1410742483 46 Sep 4 00:28 test08_ih.diff
-rw-r--r-- 1 gtoth 1410742483 33 Sep 4 00:31 test09_sc_chromo.diff
-rw-r--r-- 1 gtoth 1410742483 33 Sep 4 00:31 test09_ih.diff
-rw-r--r-- 1 gtoth 1410742483 49 Sep 4 00:34 test10_sc.diff
-rw-r--r-- 1 gtoth 1410742483 49 Sep 4 00:34 test10_ih.diff
-rw-r--r-- 1 gtoth 1410742483 25 Sep 4 00:37 test12_aniso_AMPS_gmpc.diff
-rw-r--r-- 1 gtoth 1410742483 35 Sep 4 00:38 test12_aniso_AMPS_divE_corr_gmpc.diff
-rw-r--r-- 1 gtoth 1410742483 33 Sep 4 00:40 test12_aniso_AMPS_dynamic_gmpc.diff
-rw-r--r-- 1 gtoth 1410742483 32 Sep 4 00:44 test12_aniso_AMPS_openmp_gmpc.diff
-rw-r--r-- 1 gtoth 1410742483 20 Sep 4 00:46 test12_aniso_gmpc.diff
-rw-r--r-- 1 gtoth 1410742483 18 Sep 4 00:48 test12_iso_gm.diff
-rw-r--r-- 1 gtoth 1410742483 17 Sep 4 00:50 test12_3d_gm.diff
-rw-r--r-- 1 gtoth 1410742483 49 Sep 4 00:53 test13_pt.diff
-rw-r--r-- 1 gtoth 1410742483 49 Sep 4 00:56 test14_oh.diff
-rw-r--r-- 1 gtoth 1410742483 58 Sep 4 00:59 test14pui_oh.diff
-rw-r--r-- 1 gtoth 1410742483 64 Sep 4 01:00 test14pui1d_oh.diff
-rw-r--r-- 1 gtoth 1410742483 49 Sep 4 01:04 test15_scihsp.diff
-rw-r--r-- 1 gtoth 1410742483 14 Sep 4 01:09 test16.diff
-rw-r--r-- 1 gtoth 1410742483 14 Sep 4 01:10 test17.diff
-rw-r--r-- 1 gtoth 1410742483 14 Sep 4 01:12 test18.diff
Head of SWMF_TEST_RESULTS/2020/09/03's difference files for gfortran
ERROR in DiffNum.pl: test_initial_state.out does not exist
0a1,5
> Testing line_init
> Testing line_put
> Testing line_collect
> Testing line_get on PE 0
> Testing line_clean
0a1,23
> testing 2D lookup table
> testing i_lookup_table
> testing get_lookup_table
> testing make_lookup_table
> make_lookup_table is creating table RhoE
> testing interpolate_lookup_table
> testing load_lookup_table
> testing i_lookup_table for table 2
> testing interpolate_lookup_table for loaded table
> testing 1D lookup table
> testing make_lookup_table_1d
> make_lookup_table_1d is creating table RadCool
> testing interpolate_lookup_table
> testing 1D load_lookup_table
> testing i_lookup_table for table 4
> testing interpolate_lookup_table for loaded table
> testing 3D lookup table
> testing make_lookup_table_3d
> make_lookup_table_3d is creating table B0(r,Lon,Lat)
> testing interpolate_lookup_table
> testing 3D load_lookup_table
> testing i_lookup_table for table 6
> testing interpolate_lookup_table for loaded table
Error: Different CHARACTER lengths (9/5) in array constructor at (1)
make[6]: *** [ModEquation.o] Error 1
Fatal Error: Can't open module file 'modvarindexes.mod' for reading at (1): No such file or directory
make[6]: *** [test_process_var_name.o] Error 1
Fatal Error: Can't open module file 'modvarindexes.mod' for reading at (1): No such file or directory
make[6]: *** [test_process_var_name.o] Error 1
Error: Symbol 'swhrhoux_' at (1) already has basic type of INTEGER
Error: Symbol 'rhoux_' at (1) has no IMPLICIT type
Error: Symbol 'rho_' at (1) has no IMPLICIT type
Error: Symbol 'rhoux_' at (1) has no IMPLICIT type
Error: Symbol 'rhouy_' at (1) has no IMPLICIT type
Error: Symbol 'rhouz_' at (1) has no IMPLICIT type
Error: Symbol 'p_' at (1) has no IMPLICIT type
Error: Symbol 'rhou_' at (1) has no IMPLICIT type
make[6]: *** [ModEquation.o] Error 1
Fatal Error: Can't open module file 'modvarindexes.mod' for reading at (1): No such file or directory
make[6]: *** [test_process_var_name.o] Error 1
Fatal Error: Can't open module file 'modvarindexes.mod' for reading at (1): No such file or directory
make[6]: *** [test_process_var_name.o] Error 1
ERROR: Var name not in dictionary: rho mx
ERROR: aborting execution on processor 0 with message:
ERROR: process_var_name: unknown variable rho mx
ERROR: Var name not in dictionary: mx
ERROR: aborting execution on processor 0 with message:
ERROR: process_var_name: unknown variable mx
ERROR: Var name not in dictionary: rho m
ERROR: aborting execution on processor 0 with message:
ERROR: process_var_name: unknown variable rho m
ERROR: Var name not in dictionary: mx
ERROR: aborting execution on processor 0 with message:
ERROR: process_var_name: unknown variable mx
ERROR: Var name not in dictionary: hprh
ERROR: aborting execution on processor 0 with message:
ERROR: process_var_name: unknown variable hprh
ERROR: Var name not in dictionary: rhomx
ERROR: aborting execution on processor 0 with message:
ERROR: process_var_name: unknown variable rhomx
ERROR: Var name not in dictionary: mx
ERROR: aborting execution on processor 0 with message:
ERROR: process_var_name: unknown variable mx
ERROR: Var name not in dictionary: rho
ERROR: aborting execution on processor 0 with message:
ERROR: process_var_name: unknown variable rho
ERROR: Var name not in dictionary: swrho
ERROR: aborting execution on processor 0 with message:
ERROR: process_var_name: unknown variable swrho
ERROR: Var name not in dictionary: rhomx m
ERROR: aborting execution on processor 0 with message:
ERROR: process_var_name: unknown variable rhomx m
ERROR: Var name not in dictionary: oprh
ERROR: aborting execution on processor 0 with message:
ERROR: process_var_name: unknown variable oprh
ERROR: Var name not in dictionary: oxprho
ERROR: aborting execution on processor 0 with message:
ERROR: process_var_name: unknown variable oxprho
ERROR: Var name not in dictionary:
ERROR: aborting execution on processor 0 with message:
ERROR: process_var_name: unknown variable
ERROR: Var name not in dictionary: m
ERROR: aborting execution on processor 0 with message:
ERROR: process_var_name: unknown variable m
ERROR: Var name not in dictionary: mx
ERROR: aborting execution on processor 0 with message:
ERROR: process_var_name: unknown variable mx
ERROR: Var name not in dictionary: rhom
ERROR: aborting execution on processor 0 with message:
ERROR: process_var_name: unknown variable rhom
ERROR: Var name not in dictionary: rho m
ERROR: aborting execution on processor 0 with message:
ERROR: process_var_name: unknown variable rho m
ERROR: Var name not in dictionary: rh
ERROR: aborting execution on processor 0 with message:
ERROR: process_var_name: unknown variable rh
ERROR: Var name not in dictionary: swrho
ERROR: aborting execution on processor 0 with message:
ERROR: process_var_name: unknown variable swrho
ERROR: Var name not in dictionary: h1p
ERROR: aborting execution on processor 0 with message:
ERROR: process_var_name: unknown variable h1p
ERROR: Var name not in dictionary: h1p
ERROR: aborting execution on processor 0 with message:
ERROR: process_var_name: unknown variable h1p
ERROR: Var name not in dictionary: rhom
ERROR: aborting execution on processor 0 with message:
ERROR: process_var_name: unknown variable rhom
ERROR: Var name not in dictionary:
ERROR: aborting execution on processor 0 with message:
ERROR: process_var_name: unknown variable
ERROR: Var name not in dictionary: swrho
ERROR: aborting execution on processor 0 with message:
ERROR: process_var_name: unknown variable swrho
WARNING in DiffNum.pl: there are extra numbers in test_ray_trace.log
test_fdips_compile...
test_fdips_run...
test_fdips_hypre_compile...
test_fdips_wedge_compile...
test_fdips_wedge_run...
ERROR in DiffNum.pl: run/advect11.log does not exist
ERROR in DiffNum.pl: run/advect12.log does not exist
ERROR in DiffNum.pl: run/advect21.log does not exist
ERROR in DiffNum.pl: run/advect22.log does not exist
ERROR in DiffNum.pl: run/advect22_cyl.log does not exist
ERROR in DiffNum.pl: run/advect22_round.log does not exist
ERROR in DiffNum.pl: run/advect22_rz.log does not exist
ERROR in DiffNum.pl: run/advect31.log does not exist
ERROR in DiffNum.pl: run/advect32.log does not exist
ERROR in DiffNum.pl: run/advect33.log does not exist
ERROR in DiffNum.pl: run/advect33_rlonlat.log does not exist
ERROR in DiffNum.pl: run/advect33_round.log does not exist
ERROR in DiffNum.pl: run/advect33_sph.log does not exist
WARNING in DiffNum.pl: there are extra numbers in output/readamr_1d.ref
WARNING in DiffNum.pl: there are extra numbers in output/readamr_2d.ref
WARNING in DiffNum.pl: there are extra numbers in output/readamr_3d.ref
WARNING in DiffNum.pl: there are extra numbers in output/readamr_sph.ref
WARNING in DiffNum.pl: there are extra numbers in output/test11.ref
WARNING in DiffNum.pl: there are extra numbers in output/test12.ref
WARNING in DiffNum.pl: there are extra numbers in output/test21.ref
WARNING in DiffNum.pl: there are extra numbers in output/test22.ref
WARNING in DiffNum.pl: there are extra numbers in output/test31.ref
WARNING in DiffNum.pl: there are extra numbers in output/test32.ref
WARNING in DiffNum.pl: there are extra numbers in output/test33.ref
compile...
rundir...
run...
test_2bodyplot_compile...
test_2bodyplot_rundir...
test_2bodyplot_run...
test_anisotropic_compile...
test_anisotropic_rundir...
test_anisotropic_run...
test_awsomfluids_compile...
test_awsomfluids_rundir...
test_awsomfluids_run...
test_awsomoxygen_compile...
test_awsomoxygen_rundir...
test_awsomoxygen_run...
test_chromo_compile...
test_chromo_rundir...
test_chromo_run...
test_comet_compile...
test_comet_rundir...
test_comet_run...
test_cometCGfluids_compile...
test_cometCGfluids_rundir...
test_cometCGfluids_run...
test_cometCGhd_compile...
test_cometCGhd_rundir...
test_cometCGhd_run...
test_cometfluids_compile...
test_cometfluids_rundir...
test_cometfluids_run...
test_cometfluids_restart_save...
test_coronasph_compile...
test_coronasph_rundir...
test_coronasph_run...
test_earthsph_compile...
test_earthsph_rundir...
test_earthsph_run...
test_eosgodunov_compile...
test_eosgodunov_rundir...
test_eosgodunov_run...
test_europa2fluidspe_compile...
test_europa2fluidspe_rundir...
test_europa2fluidspe_run...
test_europa3fluidspe_compile...
test_europa3fluidspe_rundir...
test_europa3fluidspe_run...
test_fivemoment_alfven_compile...
test_fivemoment_alfven_rundir...
test_fivemoment_alfven_run...
test_fivemoment_langmuir_compile...
test_fivemoment_langmuir_rundir...
test_fivemoment_langmuir_run...
test_fivemoment_shock_compile...
test_fivemoment_shock_rundir...
test_fivemoment_shock_run...
test_fluxemergence_compile...
test_fluxemergence_rundir...
test_fluxemergence_run...
-Limiter=beta -Plottype=idltecamr
test.000: run_test_func/test.000/error.000=[mesh:39646] *** Process received signal ***
[mesh:39646] Signal: Segmentation fault: 11 (11)
[mesh:39646] Signal code: (0)
[mesh:39646] Failing at address: 0x0
[mesh:39646] *** End of error message ***
test.000: run_test_func/test.000/IO2/log_n000001.log could not be opened !
-Limiter=beta -Solver=linde
test.001: run_test_func/test.001/error.001=[mesh:39725] *** Process received signal ***
[mesh:39725] Signal: Segmentation fault: 11 (11)
[mesh:39725] Signal code: (0)
[mesh:39725] Failing at address: 0x0
[mesh:39725] *** End of error message ***
test.001: run_test_func/test.001/IO2/log_n000001.log could not be opened !
-Limiter=beta -Plottype=idltecamr -Solver=sokolov
test.002: run_test_func/test.002/error.002=[mesh:39780] *** Process received signal ***
[mesh:39780] Signal: Segmentation fault: 11 (11)
[mesh:39780] Signal code: (0)
[mesh:39780] Failing at address: 0x0
[mesh:39780] *** End of error message ***
test.002: run_test_func/test.002/IO2/log_n000001.log could not be opened !
-Limiter=mc -Reschange=tvd -Solver=roe
test.003: run_test_func/test.003/error.003=[mesh:39824] *** Process received signal ***
[mesh:39824] Signal: Segmentation fault: 11 (11)
[mesh:39824] Signal code: (0)
[mesh:39824] Failing at address: 0x0
[mesh:39824] *** End of error message ***
test.003: run_test_func/test.003/IO2/log_n000001.log could not be opened !
-Conservative=r6
test.004: run_test_func/test.004/error.004=[mesh:39866] *** Process received signal ***
[mesh:39866] Signal: Segmentation fault: 11 (11)
[mesh:39866] Signal code: (0)
[mesh:39866] Failing at address: 0x0
[mesh:39866] *** End of error message ***
test.004: run_test_func/test.004/IO2/log_n000001.log could not be opened !
-Conservative=adapt -Solver=linde
test.005: run_test_func/test.005/error.005=[mesh:39908] *** Process received signal ***
[mesh:39908] Signal: Segmentation fault: 11 (11)
[mesh:39908] Signal code: (0)
[mesh:39908] Failing at address: 0x0
[mesh:39908] *** End of error message ***
test.005: run_test_func/test.005/IO2/log_n000001.log could not be opened !
-Conservative=r6 -Solver=sokolov
test.006: run_test_func/test.006/error.006=[mesh:39982] *** Process received signal ***
[mesh:39982] Signal: Segmentation fault: 11 (11)
[mesh:39982] Signal code: (0)
[mesh:39982] Failing at address: 0x0
[mesh:39982] *** End of error message ***
test.006: run_test_func/test.006/IO2/log_n000001.log could not be opened !
-Conservative=r6 -Solver=roeold
test.007: run_test_func/test.007/error.007=[mesh:40062] *** Process received signal ***
[mesh:40062] Signal: Segmentation fault: 11 (11)
[mesh:40062] Signal code: (0)
[mesh:40062] Failing at address: 0x0
[mesh:40062] *** End of error message ***
test.007: run_test_func/test.007/IO2/log_n000001.log could not be opened !
-Boris=borisfull
test.008: run_test_func/test.008/error.008=[mesh:40131] *** Process received signal ***
[mesh:40131] Signal: Segmentation fault: 11 (11)
[mesh:40131] Signal code: (0)
[mesh:40131] Failing at address: 0x0
[mesh:40131] *** End of error message ***
test.008: run_test_func/test.008/IO2/log_n000001.log could not be opened !
-Boris=borisfull -Solver=linde
test.009: run_test_func/test.009/error.009=[mesh:40173] *** Process received signal ***
[mesh:40173] Signal: Segmentation fault: 11 (11)
[mesh:40173] Signal code: (0)
[mesh:40173] Failing at address: 0x0
[mesh:40173] *** End of error message ***
test.009: run_test_func/test.009/IO2/log_n000001.log could not be opened !
-Boris=borisfull -Solver=sokolov
test.010: run_test_func/test.010/error.010=[mesh:40220] *** Process received signal ***
[mesh:40220] Signal: Segmentation fault: 11 (11)
[mesh:40220] Signal code: (0)
[mesh:40220] Failing at address: 0x0
[mesh:40220] *** End of error message ***
test.010: run_test_func/test.010/IO2/log_n000001.log could not be opened !
-Boris=borissimple
test.011: run_test_func/test.011/error.011=[mesh:40281] *** Process received signal ***
[mesh:40281] Signal: Segmentation fault: 11 (11)
[mesh:40281] Signal code: (0)
[mesh:40281] Failing at address: 0x0
[mesh:40281] *** End of error message ***
test.011: run_test_func/test.011/IO2/log_n000001.log could not be opened !
-Boris=borissimple -Solver=linde
test.012: run_test_func/test.012/error.012=[mesh:40363] *** Process received signal ***
[mesh:40363] Signal: Segmentation fault: 11 (11)
test_ganymede_compile...
test_ganymede_rundir...
test_ganymede_run...
test_graydiffusion_compile...
test_graydiffusion_rundir...
test_graydiffusion_run...
test_hallmhd_compile...
test_hallmhd_rundir...
test_hallmhd_run...
test_laserpackage_compile...
test_magnetometer_compile...
test_magnetometer_rundir...
test_magnetometer_run...
test_mars_compile...
test_mars_rundir...
test_mars_run...
test_mars_restart_save...
test_marsfluids_compile...
test_marsfluids_rundir...
test_marsfluids_run...
test_marsfluids_restart_save...
test_mercurysph_compile...
test_mercurysph_rundir...
test_mercurysph_run...
test_mhdions_compile...
test_mhdions_rundir...
test_mhdions_run...
test_mhdnoncons_compile...
test_mhdnoncons_rundir...
test_mhdnoncons_run...
test_multifluid_compile...
test_multifluid_rundir...
test_multifluid_run...
test_multiion_compile...
test_multiion_rundir...
test_multiion_run...
test_outerhelio_compile...
test_outerhelio_rundir...
test_outerhelio_run...
test_outerhelio2d_compile...
test_outerhelio2d_rundir...
test_outerhelio2d_run...
test_outerheliopui_compile...
test_outerheliopui_rundir...
test_outerheliopui_run...
test_outerheliopui_1d_compile...
test_outerheliopui_1d_rundir...
test_outerheliopui_1d_run...
test_partsteady_compile...
test_partsteady_rundir...
test_partsteady_run...
test_region2d_compile...
test_region2d_rundir...
test_region2d_run...
test_saturn_compile...
test_saturn_rundir...
test_saturn_run...
test_shockramp_compile...
test_shockramp_rundir...
test_shockramp_run...
test_shocktube_compile...
test_shocktube_rundir...
test_shocktube_run...
test_spectrum_compile...
test_spectrum_run...
test_spectrum2_compile...
test_spectrum2_run...
test_titan_compile...
test_titan_rundir...
test_titan_run...
test_titan_restart_save...
test_twofluidmhd_compile...
test_twofluidmhd_rundir...
test_twofluidmhd_run...
test_venus_compile...
test_venus_rundir...
test_venus_run...
test_venus_restart_save...
test_viscosity_compile...
test_viscosity_rundir...
test_viscosity_run...
IE/Ridley_serial test is incomplete
ERROR in DiffNum.pl: run_test/IM/plots/CIMIeq_n00000000.outs does not exist
test_compile...
test_rundir...
test_run...
test_compile...
test_rundir...
test_run...
There is no test for RCM2
ERROR in DiffNum.pl: run_test/PC/plots/log_n0001.log does not exist
ERROR in DiffNum.pl: run_test/PC/plots/log_n0001.log does not exist
ERROR in DiffNum.pl: run_test/PC/plots/log_n0001.log does not exist
test_foil_compile...
test_foil_rundir...
test_foil_run...
test_compile...
test_rundir...
test_run...
PS/DGCPM test is incomplete
test_compile...
test_rundir...
test_run...
starting...
test_restart_save...
test_compile...
test_rundir...
test_run...
starting...
test_restart_save...
SP/Kota test is incomplete
test_mflampa_compile...
test_mflampa_rundir...
test_mflampa_run...
test_mflampa_check...
test_gitm_earth_1d_compile...
test_gitm_earth_1d_rundir...
test_gitm_earth_1d_run...
test_gitm_mars_1d_compile...
test_gitm_mars_1d_rundir...
test_gitm_mars_1d_run...
test1_compile...
test1_rundir...
test1_run...
test1_compile...
test1_rundir...
test1_run...
test1_compile...
test1_rundir...
test1_run...
test4_compile...
test4_rundir...
test4_run...
test4_compile...
test4_rundir...
test4_run...
test4_compile...
test4_rundir...
test4_run...
test5_compile...
test_rundir...
test5_run...
test7_compile...
test7_rundir...
test7_run...
test7_compile...
test7_rundir...
test7_run...
test8_compile...
test8_rundir...
test8_run...
test8_compile...
test8_rundir...
test8_run...
test9_compile...
test9_rundir...
test9_compile...
test9_rundir...
test10_compile...
test10_rundir...
test10_run...
test10_compile...
test10_rundir...
test10_run...
test12_3d_run...
test12_aniso_AMPS_divE_corr_run...
test12_aniso_AMPS_dynamic_run...
test12_aniso_AMPS_run...
test12_aniso_AMPS_openmp_run...
test12_aniso_run...
test12_iso_run...
test13_compile...
test13_rundir...
test13_run...
test14_compile...
test14_rundir...
test14_run...
test14pui1d_compile...
test14pui1d_rundir...
test14pui1d_run...
test14pui_compile...
test14pui_rundir...
test14pui_run...
test15_compile...
test15_rundir...
test15_run...
test16_run...
test17_run...
test18_run...
starting...
test_ps_compile...
test_ps_rundir...
test_ps_run...
test_sp_compile...
test_sp_rundir...
test_sp_run...
test_swpc_cimi_compile...
test_swpc_cimi_rundir...
test_swpc_cimi_run...
test_swpc_cimi_compile...
test_swpc_cimi_rundir...
test_swpc_cimi_run...
test_swpc_compile...
test_swpc_rundir...
test_swpc_run...
test_swpc_compile...
test_swpc_rundir...
test_swpc_run...
test_swpc_multiion_compile...
test_swpc_multiion_rundir...
test_swpc_multiion_run...
test_swpc_multiion_compile...
test_swpc_multiion_rundir...
test_swpc_multiion_run...
test_swpc_multispecies_compile...
test_swpc_multispecies_rundir...
test_swpc_multispecies_run...
test_swpc_multispecies_compile...
test_swpc_multispecies_rundir...
test_swpc_multispecies_run...
test_swpc_compile...
test_swpc_rundir...
test_swpc_run...
==============================================================
Timings for BATSRUS|SWMF
tst run_tes run_tes diff switches
===============================================================================
000 83.19 !!! --- -Limiter=beta -Plottype=idltecamr
001 100.42 !!! --- -Limiter=beta -Solver=linde
002 80.48 !!! --- -Limiter=beta -Plottype=idltecamr -Solver=sokolov
003 71.50 !!! --- -Limiter=mc -Reschange=tvd -Solver=roe
004 83.73 !!! --- -Conservative=r6
005 100.56 !!! --- -Conservative=adapt -Solver=linde
006 80.18 !!! --- -Conservative=r6 -Solver=sokolov
007 83.60 !!! --- -Conservative=r6 -Solver=roeold
008 68.90 !!! --- -Boris=borisfull
009 79.12 !!! --- -Boris=borisfull -Solver=linde
010 69.74 !!! --- -Boris=borisfull -Solver=sokolov
011 80.07 !!! --- -Boris=borissimple
012 103.24 !!! --- -Boris=borissimple -Solver=linde
013 92.89 !!! --- -Conservative=r6 -Plottype=idltecamr -Solver=hlld -Timestep=ta
014 61.94 !!! --- -Boris=borisfull -Conservative=r6 -Timestep=ta
015 72.30 !!! --- -Boris=borissimple -Conservative=r6 -Timestep=ta
016 82.42 !!! --- -Inner=float
017 91.80 !!! --- -Inner=reflect
018 89.94 !!! --- -Limiter=mc -Resist=hall
019 124.13 !!! --- -Limiter=mc3 -Solver=hlld
020 136.45 !!! --- -Implicit=partimpl05 -Length=tiny_ta -Limiter=mc3 -Logtype=logsatmove ...
021 288.61 !!! --- -Divb=constrain -Grid=earth_uniform -Length=tiny_ta_noamr -Stage=2 -Ti...
022 117.31 !!! --- -Divb=project -Length=tiny_ta -Stage=2 -Timestep=ta
023 115.85 !!! --- -Divb=diffuse -Length=tiny_ta -Stage=2 -Timestep=ta
024 130.59 !!! --- -Implicit=partimpl05 -Length=tiny_ta -Stage=2 -Timestep=ta
025 78.22 !!! --- -Length=restartsave -Limiter=mc3 -Restart=saveone -Solver=hlld
026 40.28 !!! --- -Length=restartread -Limiter=mc3 -Restart=read -Solver=hlld
027 80.63 !!! --- -Conservative=r6 -Length=restartsave -Restart=save -Solver=hlld -Times...
028 38.22 !!! --- -Conservative=r6 -Length=restartread -Restart=read -Solver=hlld -Times...
029 63.34 !!! --- -Corotation=ideal -Length=tiny_ta -Timestep=ta
030 65.41 !!! --- -Corotation=updateb0 -Length=tiny_ta -Timestep=ta
031 89.56 !!! --- -Logtype=ray -Plottype=ray -Upstream=nsturning_1nT_tilt
032 95.76 !!! --- -Logtype=logpntflx -Plottype=sph
033 92.73 !!! --- -Plottype=los
034 63.68 --- --- -B0source=empty -Cfl=empty -Conservative=empty -Corotation=empty -Divb...
035 108.36 --- --- -Logtype=ray -Plottype=raynew -Upstream=nsturning_1nT_tilt