List of SWMF_TEST_RESULTS/2020/04/30's difference files for grid

-rw-r--r--  1 gtoth  UMROOT\   630 Apr 30 21:58 share/Library/test/test_axes.diff
-rw-r--r--  1 gtoth  UMROOT\   673 Apr 30 21:58 share/Library/test/test_coord_transform.diff
-rw-r--r--  1 gtoth  UMROOT\   629 Apr 30 21:58 share/Library/test/test_freq.diff
-rw-r--r--  1 gtoth  UMROOT\   641 Apr 30 21:58 share/Library/test/test_geopack.diff
-rw-r--r--  1 gtoth  UMROOT\   641 Apr 30 21:58 share/Library/test/test_io_unit.diff
-rw-r--r--  1 gtoth  UMROOT\   657 Apr 30 21:58 share/Library/test/test_interpolate.diff
-rw-r--r--  1 gtoth  UMROOT\   673 Apr 30 21:58 share/Library/test/test_interpolate_amr.diff
-rw-r--r--  1 gtoth  UMROOT\   692 Apr 30 21:58 share/Library/test/test_initial_state.diff
-rw-r--r--  1 gtoth  UMROOT\   663 Apr 30 21:58 share/Library/test/test_line_extract.diff
-rw-r--r--  1 gtoth  UMROOT\   677 Apr 30 21:58 share/Library/test/test_linear_advection.diff
-rw-r--r--  1 gtoth  UMROOT\   666 Apr 30 21:58 share/Library/test/test_linear_solver.diff
-rw-r--r--  1 gtoth  UMROOT\   647 Apr 30 21:58 share/Library/test/test_linear_wrapper.diff
-rw-r--r--  1 gtoth  UMROOT\   663 Apr 30 21:58 share/Library/test/test_lookup_table.diff
-rw-r--r--  1 gtoth  UMROOT\   662 Apr 30 21:58 share/Library/test/test_planet_field.diff
-rw-r--r--  1 gtoth  UMROOT\   650 Apr 30 21:58 share/Library/test/test_plot_file.diff
-rw-r--r--  1 gtoth  UMROOT\   665 Apr 30 21:58 share/Library/test/test_poisson.diff
-rw-r--r--  1 gtoth  UMROOT\   666 Apr 30 21:58 share/Library/test/test_random_number.diff
-rw-r--r--  1 gtoth  UMROOT\   650 Apr 30 21:58 share/Library/test/test_ray_trace.diff
-rw-r--r--  1 gtoth  UMROOT\   629 Apr 30 21:58 share/Library/test/test_sort.diff
-rw-r--r--  1 gtoth  UMROOT\   661 Apr 30 21:58 share/Library/test/test_time_convert.diff
-rw-r--r--  1 gtoth  UMROOT\   657 Apr 30 21:58 share/Library/test/test_triangulate.diff
-rw-r--r--  1 gtoth  UMROOT\  4888 Apr 30 22:00 share/Library/test/test_process_var_name.diff
-rw-r--r--  1 gtoth  UMROOT\   650 Apr 30 22:00 share/Library/test/test_utilities.diff
-rw-r--r--  1 gtoth  UMROOT\    26 Apr 30 22:00 util/DATAREAD/srcMagnetogram/test_harmonics.diff
-rw-r--r--  1 gtoth  UMROOT\    26 Apr 30 22:00 util/DATAREAD/srcMagnetogram/test_potential.diff
-rw-r--r--  1 gtoth  UMROOT\    22 Apr 30 22:00 util/DATAREAD/srcMagnetogram/test_fdips.diff
-rw-r--r--  1 gtoth  UMROOT\    28 Apr 30 22:00 util/DATAREAD/srcMagnetogram/test_fdips_hypre.diff
-rw-r--r--  1 gtoth  UMROOT\    28 Apr 30 22:00 util/DATAREAD/srcMagnetogram/test_fdips_wedge.diff
-rw-r--r--  1 gtoth  UMROOT\    68 Apr 30 22:00 BATL/test11.diff
-rw-r--r--  1 gtoth  UMROOT\    68 Apr 30 22:00 BATL/test12.diff
-rw-r--r--  1 gtoth  UMROOT\    68 Apr 30 22:00 BATL/test21.diff
-rw-r--r--  1 gtoth  UMROOT\    68 Apr 30 22:00 BATL/test22.diff
-rw-r--r--  1 gtoth  UMROOT\    68 Apr 30 22:01 BATL/test31.diff
-rw-r--r--  1 gtoth  UMROOT\    68 Apr 30 22:01 BATL/test32.diff
-rw-r--r--  1 gtoth  UMROOT\    68 Apr 30 22:01 BATL/test33.diff
-rw-r--r--  1 gtoth  UMROOT\    53 Apr 30 22:01 BATL/advect11.diff
-rw-r--r--  1 gtoth  UMROOT\    53 Apr 30 22:01 BATL/advect21.diff
-rw-r--r--  1 gtoth  UMROOT\    53 Apr 30 22:01 BATL/advect22.diff
-rw-r--r--  1 gtoth  UMROOT\    53 Apr 30 22:01 BATL/advect12.diff
-rw-r--r--  1 gtoth  UMROOT\    53 Apr 30 22:01 BATL/advect31.diff
-rw-r--r--  1 gtoth  UMROOT\    53 Apr 30 22:02 BATL/advect32.diff
-rw-r--r--  1 gtoth  UMROOT\    53 Apr 30 22:02 BATL/advect33.diff
-rw-r--r--  1 gtoth  UMROOT\    56 Apr 30 22:02 BATL/advect22_rz.diff
-rw-r--r--  1 gtoth  UMROOT\    57 Apr 30 22:02 BATL/advect22_cyl.diff
-rw-r--r--  1 gtoth  UMROOT\    59 Apr 30 22:02 BATL/advect22_round.diff
-rw-r--r--  1 gtoth  UMROOT\    57 Apr 30 22:02 BATL/advect33_sph.diff
-rw-r--r--  1 gtoth  UMROOT\    61 Apr 30 22:02 BATL/advect33_rlonlat.diff
-rw-r--r--  1 gtoth  UMROOT\    59 Apr 30 22:02 BATL/advect33_round.diff
-rw-r--r--  1 gtoth  UMROOT\    72 Apr 30 22:02 BATL/readamr_1d.diff
-rw-r--r--  1 gtoth  UMROOT\    72 Apr 30 22:03 BATL/readamr_2d.diff
-rw-r--r--  1 gtoth  UMROOT\    72 Apr 30 22:03 BATL/readamr_3d.diff
-rw-r--r--  1 gtoth  UMROOT\    73 Apr 30 22:04 BATL/readamr_sph.diff
-rw-r--r--  1 gtoth  UMROOT\    71 Apr 30 22:04 BATL/readamr_c.diff
-rw-r--r--  1 gtoth  UMROOT\    72 Apr 30 22:04 BATL/readamr_py.diff
-rw-r--r--  1 gtoth  UMROOT\    11 Apr 30 22:04 CZ/FSAM/test_fsam.diff
-rw-r--r--  1 gtoth  UMROOT\    30 Apr 30 22:05 GM/BATSRUS/test_fluxemergence.diff
-rw-r--r--  1 gtoth  UMROOT\    26 Apr 30 22:06 GM/BATSRUS/test_shocktube.diff
-rw-r--r--  1 gtoth  UMROOT\    26 Apr 30 22:06 GM/BATSRUS/test_shockramp.diff
-rw-r--r--  1 gtoth  UMROOT\    27 Apr 30 22:07 GM/BATSRUS/test_partsteady.diff
-rw-r--r--  1 gtoth  UMROOT\    24 Apr 30 22:07 GM/BATSRUS/test_hallmhd.diff
-rw-r--r--  1 gtoth  UMROOT\    28 Apr 30 22:08 GM/BATSRUS/test_twofluidmhd.diff
-rw-r--r--  1 gtoth  UMROOT\    27 Apr 30 22:08 GM/BATSRUS/test_multifluid.diff
-rw-r--r--  1 gtoth  UMROOT\    25 Apr 30 22:09 GM/BATSRUS/test_multiion.diff
-rw-r--r--  1 gtoth  UMROOT\    24 Apr 30 22:09 GM/BATSRUS/test_mhdions.diff
-rw-r--r--  1 gtoth  UMROOT\    27 Apr 30 22:10 GM/BATSRUS/test_mhdnoncons.diff
-rw-r--r--  1 gtoth  UMROOT\    27 Apr 30 22:10 GM/BATSRUS/test_eosgodunov.diff
-rw-r--r--  1 gtoth  UMROOT\    29 Apr 30 22:11 GM/BATSRUS/test_laserpackage.diff
-rw-r--r--  1 gtoth  UMROOT\    30 Apr 30 22:12 GM/BATSRUS/test_graydiffusion.diff
-rw-r--r--  1 gtoth  UMROOT\    26 Apr 30 22:12 GM/BATSRUS/test_viscosity.diff
-rw-r--r--  1 gtoth  UMROOT\    23 Apr 30 22:13 GM/BATSRUS/test_corona.diff
-rw-r--r--  1 gtoth  UMROOT\    26 Apr 30 22:14 GM/BATSRUS/test_coronasph.diff
-rw-r--r--  1 gtoth  UMROOT\    28 Apr 30 22:14 GM/BATSRUS/test_awsomfluids.diff
-rw-r--r--  1 gtoth  UMROOT\    23 Apr 30 22:14 GM/BATSRUS/test_chromo.diff
-rw-r--r--  1 gtoth  UMROOT\    27 Apr 30 22:15 GM/BATSRUS/test_outerhelio.diff
-rw-r--r--  1 gtoth  UMROOT\    30 Apr 30 22:15 GM/BATSRUS/test_outerheliopui.diff
-rw-r--r--  1 gtoth  UMROOT\    25 Apr 30 22:16 GM/BATSRUS/test_earthsph.diff
-rw-r--r--  1 gtoth  UMROOT\    26 Apr 30 22:16 GM/BATSRUS/test_2bodyplot.diff
-rw-r--r--  1 gtoth  UMROOT\    22 Apr 30 22:17 GM/BATSRUS/test_titan.diff
-rw-r--r--  1 gtoth  UMROOT\    27 Apr 30 22:18 GM/BATSRUS/test_titan_restart.diff
-rw-r--r--  1 gtoth  UMROOT\    21 Apr 30 22:18 GM/BATSRUS/test_mars.diff
-rw-r--r--  1 gtoth  UMROOT\    26 Apr 30 22:18 GM/BATSRUS/test_mars_restart.diff
-rw-r--r--  1 gtoth  UMROOT\    27 Apr 30 22:18 GM/BATSRUS/test_marsfluids.diff
-rw-r--r--  1 gtoth  UMROOT\    32 Apr 30 22:19 GM/BATSRUS/test_marsfluids_restart.diff
-rw-r--r--  1 gtoth  UMROOT\    22 Apr 30 22:19 GM/BATSRUS/test_venus.diff
-rw-r--r--  1 gtoth  UMROOT\    27 Apr 30 22:20 GM/BATSRUS/test_venus_restart.diff
-rw-r--r--  1 gtoth  UMROOT\    27 Apr 30 22:20 GM/BATSRUS/test_mercurysph.diff
-rw-r--r--  1 gtoth  UMROOT\    25 Apr 30 22:20 GM/BATSRUS/test_ganymede.diff
-rw-r--r--  1 gtoth  UMROOT\    23 Apr 30 22:21 GM/BATSRUS/test_saturn.diff
-rw-r--r--  1 gtoth  UMROOT\    22 Apr 30 22:21 GM/BATSRUS/test_comet.diff
-rw-r--r--  1 gtoth  UMROOT\    28 Apr 30 22:22 GM/BATSRUS/test_cometfluids.diff
-rw-r--r--  1 gtoth  UMROOT\    33 Apr 30 22:22 GM/BATSRUS/test_cometfluids_restart.diff
-rw-r--r--  1 gtoth  UMROOT\    26 Apr 30 22:22 GM/BATSRUS/test_cometCGhd.diff
-rw-r--r--  1 gtoth  UMROOT\    30 Apr 30 22:23 GM/BATSRUS/test_cometCGfluids.diff
-rw-r--r--  1 gtoth  UMROOT\    32 Apr 30 22:24 GM/BATSRUS/test_europa2fluidspe.diff
-rw-r--r--  1 gtoth  UMROOT\    32 Apr 30 22:24 GM/BATSRUS/test_europa3fluidspe.diff
-rw-r--r--  1 gtoth  UMROOT\    29 Apr 30 22:24 GM/BATSRUS/test_magnetometer.diff
-rw-r--r--  1 gtoth  UMROOT\    28 Apr 30 22:25 GM/BATSRUS/test_anisotropic.diff
-rw-r--r--  1 gtoth  UMROOT\    25 Apr 30 22:26 GM/BATSRUS/test_region2d.diff
-rw-r--r--  1 gtoth  UMROOT\    34 Apr 30 22:26 GM/BATSRUS/test_fivemoment_alfven.diff
-rw-r--r--  1 gtoth  UMROOT\    33 Apr 30 22:27 GM/BATSRUS/test_fivemoment_shock.diff
-rw-r--r--  1 gtoth  UMROOT\    36 Apr 30 22:27 GM/BATSRUS/test_fivemoment_langmuir.diff
-rw-r--r--  1 gtoth  UMROOT\    21 Apr 30 22:27 GM/BATSRUS/test_func.diff
-rw-r--r--  1 gtoth  UMROOT\    36 Apr 30 22:28 IE/Ridley_serial/notest.diff
-rw-r--r--  1 gtoth  UMROOT\    16 Apr 30 22:28 IM/CIMI/test_cimi.diff
-rw-r--r--  1 gtoth  UMROOT\    16 Apr 30 22:28 IM/HEIDI/test_analytic.diff
-rw-r--r--  1 gtoth  UMROOT\    16 Apr 30 22:28 IM/HEIDI/test_numeric.diff
-rw-r--r--  1 gtoth  UMROOT\    26 Apr 30 22:28 IM/RCM2/notest.diff
-rw-r--r--  1 gtoth  UMROOT\    22 Apr 30 22:28 PC/ALTOR/test_altor.diff
-rw-r--r--  1 gtoth  UMROOT\    25 Apr 30 22:28 PC/ALTOR/test_altor_2d.diff
-rw-r--r--  1 gtoth  UMROOT\    21 Apr 30 22:29 PC/ALTOR/test_beam.diff
-rw-r--r--  1 gtoth  UMROOT\    21 Apr 30 22:29 PC/ALTOR/test_foil.diff
-rw-r--r--  1 gtoth  UMROOT\    16 Apr 30 22:29 PC/IPIC3D2/test_ipic3d.diff
-rw-r--r--  1 gtoth  UMROOT\    28 Apr 30 22:29 PS/DGCPM/notest.diff
-rw-r--r--  1 gtoth  UMROOT\    12 Apr 30 22:29 PW/PWOM/test_Saturn_plots.diff
-rw-r--r--  1 gtoth  UMROOT\    16 Apr 30 22:29 PW/PWOM/test_Saturn.diff
-rw-r--r--  1 gtoth  UMROOT\    21 Apr 30 22:29 PW/PWOM/test_Saturn_restart.diff
-rw-r--r--  1 gtoth  UMROOT\    12 Apr 30 22:29 PW/PWOM/test_Earth_plots.diff
-rw-r--r--  1 gtoth  UMROOT\    16 Apr 30 22:29 PW/PWOM/test_Earth.diff
-rw-r--r--  1 gtoth  UMROOT\    21 Apr 30 22:29 PW/PWOM/test_Earth_restart.diff
-rw-r--r--  1 gtoth  UMROOT\    16 Apr 30 22:29 RB/RBE/test.diff
-rw-r--r--  1 gtoth  UMROOT\    27 Apr 30 22:29 SP/Kota/notest.diff
-rw-r--r--  1 gtoth  UMROOT\    24 Apr 30 22:29 SP/MFLAMPA/test_mflampa.diff
-rw-r--r--  1 gtoth  UMROOT\    30 Apr 30 22:29 UA/GITM2/test_gitm_earth_1d.diff
-rw-r--r--  1 gtoth  UMROOT\    29 Apr 30 22:30 UA/GITM2/test_gitm_mars_1d.diff
-rw-r--r--  1 gtoth  UMROOT\    31 Apr 30 22:30 test_ps.diff
-rw-r--r--  1 gtoth  UMROOT\    21 Apr 30 22:31 test_swpc_gm.diff
-rw-r--r--  1 gtoth  UMROOT\    21 Apr 30 22:31 test_swpc_ie.diff
-rw-r--r--  1 gtoth  UMROOT\    21 Apr 30 22:31 test_swpc_rb.diff
-rw-r--r--  1 gtoth  UMROOT\    30 Apr 30 22:32 test_swpc_multiion_gm.diff
-rw-r--r--  1 gtoth  UMROOT\    30 Apr 30 22:32 test_swpc_multiion_ie.diff
-rw-r--r--  1 gtoth  UMROOT\    34 Apr 30 22:32 test_swpc_multispecies_gm.diff
-rw-r--r--  1 gtoth  UMROOT\    34 Apr 30 22:32 test_swpc_multispecies_ie.diff
-rw-r--r--  1 gtoth  UMROOT\    26 Apr 30 22:33 test_swpc_cimi_gm.diff
-rw-r--r--  1 gtoth  UMROOT\    26 Apr 30 22:33 test_swpc_cimi_ie.diff
-rw-r--r--  1 gtoth  UMROOT\    17 Apr 30 22:34 test01_gm.diff
-rw-r--r--  1 gtoth  UMROOT\    17 Apr 30 22:34 test01_ie.diff
-rw-r--r--  1 gtoth  UMROOT\    17 Apr 30 22:34 test01_pw.diff
-rw-r--r--  1 gtoth  UMROOT\    17 Apr 30 22:34 test03_gm.diff
-rw-r--r--  1 gtoth  UMROOT\    17 Apr 30 22:34 test03_ie.diff
-rw-r--r--  1 gtoth  UMROOT\    17 Apr 30 22:34 test03_im_cimi.diff
-rw-r--r--  1 gtoth  UMROOT\    17 Apr 30 22:35 test04_gm.diff
-rw-r--r--  1 gtoth  UMROOT\    17 Apr 30 22:35 test04_ie.diff
-rw-r--r--  1 gtoth  UMROOT\    17 Apr 30 22:35 test04_im_heidi.diff
-rw-r--r--  1 gtoth  UMROOT\    17 Apr 30 22:36 test05_ee.diff
-rw-r--r--  1 gtoth  UMROOT\    17 Apr 30 22:38 test07_ih.diff
-rw-r--r--  1 gtoth  UMROOT\    17 Apr 30 22:38 test07_oh.diff
-rw-r--r--  1 gtoth  UMROOT\    17 Apr 30 22:39 test08_sc_thread.diff
-rw-r--r--  1 gtoth  UMROOT\    17 Apr 30 22:39 test08_ih.diff
-rw-r--r--  1 gtoth  UMROOT\    17 Apr 30 22:40 test09_sc_chromo.diff
-rw-r--r--  1 gtoth  UMROOT\    17 Apr 30 22:40 test09_ih.diff
-rw-r--r--  1 gtoth  UMROOT\    18 Apr 30 22:42 test10_sc.diff
-rw-r--r--  1 gtoth  UMROOT\    18 Apr 30 22:42 test10_ih.diff
-rw-r--r--  1 gtoth  UMROOT\    29 Apr 30 22:43 test12_aniso_AMPS_gmpc.diff
-rw-r--r--  1 gtoth  UMROOT\    39 Apr 30 22:44 test12_aniso_AMPS_divE_corr_gmpc.diff
-rw-r--r--  1 gtoth  UMROOT\    37 Apr 30 22:45 test12_aniso_AMPS_dynamic_gmpc.diff
-rw-r--r--  1 gtoth  UMROOT\    36 Apr 30 22:47 test12_aniso_AMPS_openmp_gmpc.diff
-rw-r--r--  1 gtoth  UMROOT\    24 Apr 30 22:48 test12_aniso_gmpc.diff
-rw-r--r--  1 gtoth  UMROOT\    22 Apr 30 22:49 test12_iso_gm.diff
-rw-r--r--  1 gtoth  UMROOT\    21 Apr 30 22:50 test12_3d_gm.diff
-rw-r--r--  1 gtoth  UMROOT\    18 Apr 30 22:50 test13_pt.diff
-rw-r--r--  1 gtoth  UMROOT\    18 Apr 30 22:52 test14_ohpt.diff
-rw-r--r--  1 gtoth  UMROOT\    25 Apr 30 22:54 test15_scihsp.diff
-rw-r--r--  1 gtoth  UMROOT\    18 Apr 30 22:55 test16.diff
-rw-r--r--  1 gtoth  UMROOT\    18 Apr 30 22:57 test17.diff
-rw-r--r--  1 gtoth  UMROOT\    18 Apr 30 22:58 test18.diff

Head of SWMF_TEST_RESULTS/2020/04/30's difference files for grid

share/Library/test/test_axes (SWMF_TEST_RESULTS/2020/04/30: grid)

test_axes starting
/Applications/Xcode.app/Contents/Developer/usr/bin/make /Users/gtoth/Tmp_nag_debug/SWMF/lib/libSHARE.a
make[6]: `/Users/gtoth/Tmp_nag_debug/SWMF/lib/libSHARE.a' is up to date.

/Users/gtoth/Tmp_nag_debug/SWMF/lib/libSHARE.a has been brought up to date.

nagfor -mdir /Users/gtoth/Tmp_nag_debug/SWMF/share/include -I/Users/gtoth/Tmp_nag_debug/SWMF/share/include  -c -w -ideclient -Wc=`which gcc`  -C -gline -nan -default_kinds:r=64 -O0 test_axes.f90
mpif90 -o test_axes.exe test_axes.o \
		-L/Users/gtoth/Tmp_nag_debug/SWMF/lib -lSHARE -default_kinds:r=64  -lstdc++ -C -gline -nan -Wl,-w -Wl=`which gcc` -lgomp 

share/Library/test/test_coord_transform (SWMF_TEST_RESULTS/2020/04/30: grid)

test_coord_transform starting
/Applications/Xcode.app/Contents/Developer/usr/bin/make /Users/gtoth/Tmp_nag_debug/SWMF/lib/libSHARE.a
make[6]: `/Users/gtoth/Tmp_nag_debug/SWMF/lib/libSHARE.a' is up to date.

/Users/gtoth/Tmp_nag_debug/SWMF/lib/libSHARE.a has been brought up to date.

nagfor -mdir /Users/gtoth/Tmp_nag_debug/SWMF/share/include -I/Users/gtoth/Tmp_nag_debug/SWMF/share/include  -c -w -ideclient -Wc=`which gcc`  -C -gline -nan -default_kinds:r=64 -O0 test_coord_transform.f90
mpif90 -o test_coord_transform.exe test_coord_transform.o \
		-L/Users/gtoth/Tmp_nag_debug/SWMF/lib -lSHARE -default_kinds:r=64  -lstdc++ -C -gline -nan -Wl,-w -Wl=`which gcc` -lgomp

share/Library/test/test_freq (SWMF_TEST_RESULTS/2020/04/30: grid)

test_freq starting
/Applications/Xcode.app/Contents/Developer/usr/bin/make /Users/gtoth/Tmp_nag_debug/SWMF/lib/libSHARE.a
make[6]: `/Users/gtoth/Tmp_nag_debug/SWMF/lib/libSHARE.a' is up to date.

/Users/gtoth/Tmp_nag_debug/SWMF/lib/libSHARE.a has been brought up to date.

nagfor -mdir /Users/gtoth/Tmp_nag_debug/SWMF/share/include -I/Users/gtoth/Tmp_nag_debug/SWMF/share/include  -c -w -ideclient -Wc=`which gcc`  -C -gline -nan -default_kinds:r=64 -O0 test_freq.f90
mpif90 -o test_freq.exe test_freq.o \
		-L/Users/gtoth/Tmp_nag_debug/SWMF/lib -lSHARE -default_kinds:r=64  -lstdc++ -C -gline -nan -Wl,-w -Wl=`which gcc` -lgomp

share/Library/test/test_geopack (SWMF_TEST_RESULTS/2020/04/30: grid)

test_geopack starting
/Applications/Xcode.app/Contents/Developer/usr/bin/make /Users/gtoth/Tmp_nag_debug/SWMF/lib/libSHARE.a
make[6]: `/Users/gtoth/Tmp_nag_debug/SWMF/lib/libSHARE.a' is up to date.

/Users/gtoth/Tmp_nag_debug/SWMF/lib/libSHARE.a has been brought up to date.

nagfor -mdir /Users/gtoth/Tmp_nag_debug/SWMF/share/include -I/Users/gtoth/Tmp_nag_debug/SWMF/share/include  -c -w -ideclient -Wc=`which gcc`  -C -gline -nan -default_kinds:r=64 -O0 test_geopack.f90
mpif90 -o test_geopack.exe test_geopack.o \
		-L/Users/gtoth/Tmp_nag_debug/SWMF/lib -lSHARE -default_kinds:r=64  -lstdc++ -C -gline -nan -Wl,-w -Wl=`which gcc` -lgomp

share/Library/test/test_initial_state (SWMF_TEST_RESULTS/2020/04/30: grid)

test_initial_state starting
/Applications/Xcode.app/Contents/Developer/usr/bin/make /Users/gtoth/Tmp_nag_debug/SWMF/lib/libSHARE.a
make[6]: `/Users/gtoth/Tmp_nag_debug/SWMF/lib/libSHARE.a' is up to date.

/Users/gtoth/Tmp_nag_debug/SWMF/lib/libSHARE.a has been brought up to date.

make test_initial_state.o
nagfor -mdir /Users/gtoth/Tmp_nag_debug/SWMF/share/include -I/Users/gtoth/Tmp_nag_debug/SWMF/share/include  -c -w -ideclient -Wc=`which gcc`  -C -gline -nan -default_kinds:r=64 -O0 test_initial_state.f90
mpif90 -o test_initial_state.exe test_initial_state.o \
		-L/Users/gtoth/Tmp_nag_debug/SWMF/lib -lSHARE -default_kinds:r=64  -lstdc++ -C -gline -nan -Wl,-w -Wl=`which gcc` -lgomp 

share/Library/test/test_interpolate (SWMF_TEST_RESULTS/2020/04/30: grid)

test_interpolate starting
/Applications/Xcode.app/Contents/Developer/usr/bin/make /Users/gtoth/Tmp_nag_debug/SWMF/lib/libSHARE.a
make[6]: `/Users/gtoth/Tmp_nag_debug/SWMF/lib/libSHARE.a' is up to date.

/Users/gtoth/Tmp_nag_debug/SWMF/lib/libSHARE.a has been brought up to date.

nagfor -mdir /Users/gtoth/Tmp_nag_debug/SWMF/share/include -I/Users/gtoth/Tmp_nag_debug/SWMF/share/include  -c -w -ideclient -Wc=`which gcc`  -C -gline -nan -default_kinds:r=64 -O0 test_interpolate.f90
mpif90 -o test_interpolate.exe test_interpolate.o \
		-L/Users/gtoth/Tmp_nag_debug/SWMF/lib -lSHARE -default_kinds:r=64  -lstdc++ -C -gline -nan -Wl,-w -Wl=`which gcc` -lgomp

share/Library/test/test_interpolate_amr (SWMF_TEST_RESULTS/2020/04/30: grid)

test_interpolate_amr starting
/Applications/Xcode.app/Contents/Developer/usr/bin/make /Users/gtoth/Tmp_nag_debug/SWMF/lib/libSHARE.a
make[6]: `/Users/gtoth/Tmp_nag_debug/SWMF/lib/libSHARE.a' is up to date.

/Users/gtoth/Tmp_nag_debug/SWMF/lib/libSHARE.a has been brought up to date.

nagfor -mdir /Users/gtoth/Tmp_nag_debug/SWMF/share/include -I/Users/gtoth/Tmp_nag_debug/SWMF/share/include  -c -w -ideclient -Wc=`which gcc`  -C -gline -nan -default_kinds:r=64 -O0 test_interpolate_amr.f90
mpif90 -o test_interpolate_amr.exe test_interpolate_amr.o \
		-L/Users/gtoth/Tmp_nag_debug/SWMF/lib -lSHARE -default_kinds:r=64  -lstdc++ -C -gline -nan -Wl,-w -Wl=`which gcc` -lgomp

share/Library/test/test_io_unit (SWMF_TEST_RESULTS/2020/04/30: grid)

test_io_unit starting
/Applications/Xcode.app/Contents/Developer/usr/bin/make /Users/gtoth/Tmp_nag_debug/SWMF/lib/libSHARE.a
make[6]: `/Users/gtoth/Tmp_nag_debug/SWMF/lib/libSHARE.a' is up to date.

/Users/gtoth/Tmp_nag_debug/SWMF/lib/libSHARE.a has been brought up to date.

nagfor -mdir /Users/gtoth/Tmp_nag_debug/SWMF/share/include -I/Users/gtoth/Tmp_nag_debug/SWMF/share/include  -c -w -ideclient -Wc=`which gcc`  -C -gline -nan -default_kinds:r=64 -O0 test_io_unit.f90
mpif90 -o test_io_unit.exe test_io_unit.o \
		-L/Users/gtoth/Tmp_nag_debug/SWMF/lib -lSHARE -default_kinds:r=64  -lstdc++ -C -gline -nan -Wl,-w -Wl=`which gcc` -lgomp

share/Library/test/test_line_extract (SWMF_TEST_RESULTS/2020/04/30: grid)

test_line_extract starting
/Applications/Xcode.app/Contents/Developer/usr/bin/make /Users/gtoth/Tmp_nag_debug/SWMF/lib/libSHARE.a
make[6]: `/Users/gtoth/Tmp_nag_debug/SWMF/lib/libSHARE.a' is up to date.

/Users/gtoth/Tmp_nag_debug/SWMF/lib/libSHARE.a has been brought up to date.

nagfor -mdir /Users/gtoth/Tmp_nag_debug/SWMF/share/include -I/Users/gtoth/Tmp_nag_debug/SWMF/share/include  -c -w -ideclient -Wc=`which gcc`  -C -gline -nan -default_kinds:r=64 -O0 test_line_extract.f90
mpif90 -o test_line_extract.exe test_line_extract.o \
		-L/Users/gtoth/Tmp_nag_debug/SWMF/lib -lSHARE  -default_kinds:r=64  -lstdc++ -C -gline -nan -Wl,-w -Wl=`which gcc` -lgomp 

share/Library/test/test_linear_advection (SWMF_TEST_RESULTS/2020/04/30: grid)

test_linear_advection starting
/Applications/Xcode.app/Contents/Developer/usr/bin/make /Users/gtoth/Tmp_nag_debug/SWMF/lib/libSHARE.a
make[6]: `/Users/gtoth/Tmp_nag_debug/SWMF/lib/libSHARE.a' is up to date.

/Users/gtoth/Tmp_nag_debug/SWMF/lib/libSHARE.a has been brought up to date.

nagfor -mdir /Users/gtoth/Tmp_nag_debug/SWMF/share/include -I/Users/gtoth/Tmp_nag_debug/SWMF/share/include  -c -w -ideclient -Wc=`which gcc`  -C -gline -nan -default_kinds:r=64 -O0 test_linear_advection.f90
mpif90 -o test_linear_advection.exe test_linear_advection.o \
		-L/Users/gtoth/Tmp_nag_debug/SWMF/lib -lSHARE -default_kinds:r=64  -lstdc++ -C -gline -nan -Wl,-w -Wl=`which gcc` -lgomp

share/Library/test/test_linear_solver (SWMF_TEST_RESULTS/2020/04/30: grid)

test_linear_solver starting
/Applications/Xcode.app/Contents/Developer/usr/bin/make /Users/gtoth/Tmp_nag_debug/SWMF/lib/libSHARE.a
make[6]: `/Users/gtoth/Tmp_nag_debug/SWMF/lib/libSHARE.a' is up to date.

/Users/gtoth/Tmp_nag_debug/SWMF/lib/libSHARE.a has been brought up to date.

nagfor -mdir /Users/gtoth/Tmp_nag_debug/SWMF/share/include -I/Users/gtoth/Tmp_nag_debug/SWMF/share/include  -c -w -ideclient -Wc=`which gcc`  -C -gline -nan -default_kinds:r=64 -O0 test_linear_solver.f90
mpif90 -o test_linear_solver.exe test_linear_solver.o \
		-L/Users/gtoth/Tmp_nag_debug/SWMF/lib -lSHARE -default_kinds:r=64  -lstdc++ -C -gline -nan -Wl,-w -Wl=`which gcc` -lgomp 

share/Library/test/test_linear_wrapper (SWMF_TEST_RESULTS/2020/04/30: grid)

test_linear_wrapper starting
(cd ../src; make LIB)
/Applications/Xcode.app/Contents/Developer/usr/bin/make /Users/gtoth/Tmp_nag_debug/SWMF/lib/libSHARE.a
make[6]: `/Users/gtoth/Tmp_nag_debug/SWMF/lib/libSHARE.a' is up to date.

/Users/gtoth/Tmp_nag_debug/SWMF/lib/libSHARE.a has been brought up to date.

make test_linear_wrapper.o
mpicxx -I/Users/gtoth/Tmp_nag_debug/SWMF/share/Library/src  -c -O0  -g  -std=c++14 test_linear_wrapper.cpp -o test_linear_wrapper.o
mpif90  -o test_linear_wrapper.exe test_linear_wrapper.o \
		-L/Users/gtoth/Tmp_nag_debug/SWMF/lib -lSHARE -default_kinds:r=64  -lstdc++ -C -gline -nan -Wl,-w -Wl=`which gcc` -lgomp 

share/Library/test/test_lookup_table (SWMF_TEST_RESULTS/2020/04/30: grid)

test_lookup_table starting
/Applications/Xcode.app/Contents/Developer/usr/bin/make /Users/gtoth/Tmp_nag_debug/SWMF/lib/libSHARE.a
make[6]: `/Users/gtoth/Tmp_nag_debug/SWMF/lib/libSHARE.a' is up to date.

/Users/gtoth/Tmp_nag_debug/SWMF/lib/libSHARE.a has been brought up to date.

nagfor -mdir /Users/gtoth/Tmp_nag_debug/SWMF/share/include -I/Users/gtoth/Tmp_nag_debug/SWMF/share/include  -c -w -ideclient -Wc=`which gcc`  -C -gline -nan -default_kinds:r=64 -O0 test_lookup_table.f90
mpif90 -o test_lookup_table.exe test_lookup_table.o \
		 -L/Users/gtoth/Tmp_nag_debug/SWMF/lib -lSHARE -default_kinds:r=64  -lstdc++ -C -gline -nan -Wl,-w -Wl=`which gcc` -lgomp 

share/Library/test/test_planet_field (SWMF_TEST_RESULTS/2020/04/30: grid)

test_planet_field starting
/Applications/Xcode.app/Contents/Developer/usr/bin/make /Users/gtoth/Tmp_nag_debug/SWMF/lib/libSHARE.a
make[6]: `/Users/gtoth/Tmp_nag_debug/SWMF/lib/libSHARE.a' is up to date.

/Users/gtoth/Tmp_nag_debug/SWMF/lib/libSHARE.a has been brought up to date.

nagfor -mdir /Users/gtoth/Tmp_nag_debug/SWMF/share/include -I/Users/gtoth/Tmp_nag_debug/SWMF/share/include  -c -w -ideclient -Wc=`which gcc`  -C -gline -nan -default_kinds:r=64 -O0 test_planet_field.f90
mpif90 -o test_planet_field.exe test_planet_field.o \
		-L/Users/gtoth/Tmp_nag_debug/SWMF/lib -lSHARE -default_kinds:r=64  -lstdc++ -C -gline -nan -Wl,-w -Wl=`which gcc` -lgomp 

share/Library/test/test_plot_file (SWMF_TEST_RESULTS/2020/04/30: grid)

test_plot_file starting
/Applications/Xcode.app/Contents/Developer/usr/bin/make /Users/gtoth/Tmp_nag_debug/SWMF/lib/libSHARE.a
make[6]: `/Users/gtoth/Tmp_nag_debug/SWMF/lib/libSHARE.a' is up to date.

/Users/gtoth/Tmp_nag_debug/SWMF/lib/libSHARE.a has been brought up to date.

nagfor -mdir /Users/gtoth/Tmp_nag_debug/SWMF/share/include -I/Users/gtoth/Tmp_nag_debug/SWMF/share/include  -c -w -ideclient -Wc=`which gcc`  -C -gline -nan -default_kinds:r=64 -O0 test_plot_file.f90
mpif90 -o test_plot_file.exe test_plot_file.o \
		-L/Users/gtoth/Tmp_nag_debug/SWMF/lib -lSHARE -default_kinds:r=64  -lstdc++ -C -gline -nan -Wl,-w -Wl=`which gcc` -lgomp 

share/Library/test/test_poisson (SWMF_TEST_RESULTS/2020/04/30: grid)

test_poisson_bracket starting
/Applications/Xcode.app/Contents/Developer/usr/bin/make /Users/gtoth/Tmp_nag_debug/SWMF/lib/libSHARE.a
make[6]: `/Users/gtoth/Tmp_nag_debug/SWMF/lib/libSHARE.a' is up to date.

/Users/gtoth/Tmp_nag_debug/SWMF/lib/libSHARE.a has been brought up to date.

nagfor -mdir /Users/gtoth/Tmp_nag_debug/SWMF/share/include -I/Users/gtoth/Tmp_nag_debug/SWMF/share/include  -c -w -ideclient -Wc=`which gcc`  -C -gline -nan -default_kinds:r=64 -O0 test_poisson_bracket.f90
mpif90 -o test_poisson.exe test_poisson_bracket.o \
		-L/Users/gtoth/Tmp_nag_debug/SWMF/lib -lSHARE -default_kinds:r=64  -lstdc++ -C -gline -nan -Wl,-w -Wl=`which gcc` -lgomp

share/Library/test/test_process_var_name (SWMF_TEST_RESULTS/2020/04/30: grid)

collect2: fatal error: ld terminated with signal 6 [Abort trap: 6]
collect2: fatal error: ld terminated with signal 6 [Abort trap: 6]
collect2: fatal error: ld terminated with signal 6 [Abort trap: 6]
collect2: fatal error: ld terminated with signal 6 [Abort trap: 6]
collect2: fatal error: ld terminated with signal 6 [Abort trap: 6]
collect2: fatal error: ld terminated with signal 6 [Abort trap: 6]
collect2: fatal error: ld terminated with signal 6 [Abort trap: 6]
collect2: fatal error: ld terminated with signal 6 [Abort trap: 6]
collect2: fatal error: ld terminated with signal 6 [Abort trap: 6]
collect2: fatal error: ld terminated with signal 6 [Abort trap: 6]
collect2: fatal error: ld terminated with signal 6 [Abort trap: 6]
collect2: fatal error: ld terminated with signal 6 [Abort trap: 6]
collect2: fatal error: ld terminated with signal 6 [Abort trap: 6]
collect2: fatal error: ld terminated with signal 6 [Abort trap: 6]
collect2: fatal error: ld terminated with signal 6 [Abort trap: 6]
collect2: fatal error: ld terminated with signal 6 [Abort trap: 6]
collect2: fatal error: ld terminated with signal 6 [Abort trap: 6]
collect2: fatal error: ld terminated with signal 6 [Abort trap: 6]
collect2: fatal error: ld terminated with signal 6 [Abort trap: 6]
collect2: fatal error: ld terminated with signal 6 [Abort trap: 6]
collect2: fatal error: ld terminated with signal 6 [Abort trap: 6]
collect2: fatal error: ld terminated with signal 6 [Abort trap: 6]
collect2: fatal error: ld terminated with signal 6 [Abort trap: 6]
collect2: fatal error: ld terminated with signal 6 [Abort trap: 6]
collect2: fatal error: ld terminated with signal 6 [Abort trap: 6]
collect2: fatal error: ld terminated with signal 6 [Abort trap: 6]
collect2: fatal error: ld terminated with signal 6 [Abort trap: 6]
collect2: fatal error: ld terminated with signal 6 [Abort trap: 6]
collect2: fatal error: ld terminated with signal 6 [Abort trap: 6]
collect2: fatal error: ld terminated with signal 6 [Abort trap: 6]
collect2: fatal error: ld terminated with signal 6 [Abort trap: 6]
collect2: fatal error: ld terminated with signal 6 [Abort trap: 6]
collect2: fatal error: ld terminated with signal 6 [Abort trap: 6]
collect2: fatal error: ld terminated with signal 6 [Abort trap: 6]
collect2: fatal error: ld terminated with signal 6 [Abort trap: 6]
collect2: fatal error: ld terminated with signal 6 [Abort trap: 6]
collect2: fatal error: ld terminated with signal 6 [Abort trap: 6]
collect2: fatal error: ld terminated with signal 6 [Abort trap: 6]
collect2: fatal error: ld terminated with signal 6 [Abort trap: 6]
collect2: fatal error: ld terminated with signal 6 [Abort trap: 6]
collect2: fatal error: ld terminated with signal 6 [Abort trap: 6]
collect2: fatal error: ld terminated with signal 6 [Abort trap: 6]
collect2: fatal error: ld terminated with signal 6 [Abort trap: 6]
collect2: fatal error: ld terminated with signal 6 [Abort trap: 6]
collect2: fatal error: ld terminated with signal 6 [Abort trap: 6]
collect2: fatal error: ld terminated with signal 6 [Abort trap: 6]
collect2: fatal error: ld terminated with signal 6 [Abort trap: 6]
collect2: fatal error: ld terminated with signal 6 [Abort trap: 6]
collect2: fatal error: ld terminated with signal 6 [Abort trap: 6]
collect2: fatal error: ld terminated with signal 6 [Abort trap: 6]
collect2: fatal error: ld terminated with signal 6 [Abort trap: 6]
collect2: fatal error: ld terminated with signal 6 [Abort trap: 6]
collect2: fatal error: ld terminated with signal 6 [Abort trap: 6]
collect2: fatal error: ld terminated with signal 6 [Abort trap: 6]
collect2: fatal error: ld terminated with signal 6 [Abort trap: 6]
collect2: fatal error: ld terminated with signal 6 [Abort trap: 6]
collect2: fatal error: ld terminated with signal 6 [Abort trap: 6]
collect2: fatal error: ld terminated with signal 6 [Abort trap: 6]
collect2: fatal error: ld terminated with signal 6 [Abort trap: 6]
collect2: fatal error: ld terminated with signal 6 [Abort trap: 6]
collect2: fatal error: ld terminated with signal 6 [Abort trap: 6]
collect2: fatal error: ld terminated with signal 6 [Abort trap: 6]
Error: ModEquation.f90, line 28: Duplicate type declaration for SWHRHOUX_
Error: ModEquation.f90, line 28: PARAMETER SWHRHOUX_ has already been defined
Error: ModEquation.f90, line 97: Duplicate type declaration for UX_
Error: ModEquation.f90, line 97: PARAMETER UX_ has already been defined
Error: ModEquation.f90, line 97: Duplicate type declaration for UY_
Error: ModEquation.f90, line 97: PARAMETER UY_ has already been defined
Error: ModEquation.f90, line 97: Duplicate type declaration for UZ_
Error: ModEquation.f90, line 97: PARAMETER UZ_ has already been defined
[NAG Fortran Compiler pass 1 error termination, 8 errors]
make[6]: *** [ModEquation.o] Error 2
collect2: fatal error: ld terminated with signal 6 [Abort trap: 6]

share/Library/test/test_random_number (SWMF_TEST_RESULTS/2020/04/30: grid)

test_random_number starting
/Applications/Xcode.app/Contents/Developer/usr/bin/make /Users/gtoth/Tmp_nag_debug/SWMF/lib/libSHARE.a
make[6]: `/Users/gtoth/Tmp_nag_debug/SWMF/lib/libSHARE.a' is up to date.

/Users/gtoth/Tmp_nag_debug/SWMF/lib/libSHARE.a has been brought up to date.

nagfor -mdir /Users/gtoth/Tmp_nag_debug/SWMF/share/include -I/Users/gtoth/Tmp_nag_debug/SWMF/share/include  -c -w -ideclient -Wc=`which gcc`  -C -gline -nan -default_kinds:r=64 -O0 test_random_number.f90
mpif90 -o test_random_number.exe test_random_number.o \
		-L/Users/gtoth/Tmp_nag_debug/SWMF/lib -lSHARE  -default_kinds:r=64  -lstdc++ -C -gline -nan -Wl,-w -Wl=`which gcc` -lgomp

share/Library/test/test_ray_trace (SWMF_TEST_RESULTS/2020/04/30: grid)

test_ray_trace starting
/Applications/Xcode.app/Contents/Developer/usr/bin/make /Users/gtoth/Tmp_nag_debug/SWMF/lib/libSHARE.a
make[6]: `/Users/gtoth/Tmp_nag_debug/SWMF/lib/libSHARE.a' is up to date.

/Users/gtoth/Tmp_nag_debug/SWMF/lib/libSHARE.a has been brought up to date.

nagfor -mdir /Users/gtoth/Tmp_nag_debug/SWMF/share/include -I/Users/gtoth/Tmp_nag_debug/SWMF/share/include  -c -w -ideclient -Wc=`which gcc`  -C -gline -nan -default_kinds:r=64 -O0 test_ray_trace.f90
mpif90 -o test_ray_trace.exe test_ray_trace.o \
		-L/Users/gtoth/Tmp_nag_debug/SWMF/lib -lSHARE -default_kinds:r=64  -lstdc++ -C -gline -nan -Wl,-w -Wl=`which gcc` -lgomp 

share/Library/test/test_sort (SWMF_TEST_RESULTS/2020/04/30: grid)

test_sort starting
/Applications/Xcode.app/Contents/Developer/usr/bin/make /Users/gtoth/Tmp_nag_debug/SWMF/lib/libSHARE.a
make[6]: `/Users/gtoth/Tmp_nag_debug/SWMF/lib/libSHARE.a' is up to date.

/Users/gtoth/Tmp_nag_debug/SWMF/lib/libSHARE.a has been brought up to date.

nagfor -mdir /Users/gtoth/Tmp_nag_debug/SWMF/share/include -I/Users/gtoth/Tmp_nag_debug/SWMF/share/include  -c -w -ideclient -Wc=`which gcc`  -C -gline -nan -default_kinds:r=64 -O0 test_sort.f90
mpif90 -o test_sort.exe test_sort.o \
		-L/Users/gtoth/Tmp_nag_debug/SWMF/lib -lSHARE -default_kinds:r=64  -lstdc++ -C -gline -nan -Wl,-w -Wl=`which gcc` -lgomp

share/Library/test/test_time_convert (SWMF_TEST_RESULTS/2020/04/30: grid)

test_time_convert starting
/Applications/Xcode.app/Contents/Developer/usr/bin/make /Users/gtoth/Tmp_nag_debug/SWMF/lib/libSHARE.a
make[6]: `/Users/gtoth/Tmp_nag_debug/SWMF/lib/libSHARE.a' is up to date.

/Users/gtoth/Tmp_nag_debug/SWMF/lib/libSHARE.a has been brought up to date.

nagfor -mdir /Users/gtoth/Tmp_nag_debug/SWMF/share/include -I/Users/gtoth/Tmp_nag_debug/SWMF/share/include  -c -w -ideclient -Wc=`which gcc`  -C -gline -nan -default_kinds:r=64 -O0 test_time_convert.f90
mpif90 -o test_time_convert.exe test_time_convert.o \
		-L/Users/gtoth/Tmp_nag_debug/SWMF/lib -lSHARE -default_kinds:r=64  -lstdc++ -C -gline -nan -Wl,-w -Wl=`which gcc` -lgomp

share/Library/test/test_triangulate (SWMF_TEST_RESULTS/2020/04/30: grid)

test_triangulate starting
/Applications/Xcode.app/Contents/Developer/usr/bin/make /Users/gtoth/Tmp_nag_debug/SWMF/lib/libSHARE.a
make[6]: `/Users/gtoth/Tmp_nag_debug/SWMF/lib/libSHARE.a' is up to date.

/Users/gtoth/Tmp_nag_debug/SWMF/lib/libSHARE.a has been brought up to date.

nagfor -mdir /Users/gtoth/Tmp_nag_debug/SWMF/share/include -I/Users/gtoth/Tmp_nag_debug/SWMF/share/include  -c -w -ideclient -Wc=`which gcc`  -C -gline -nan -default_kinds:r=64 -O0 test_triangulate.f90
mpif90 -o test_triangulate.exe test_triangulate.o \
		-L/Users/gtoth/Tmp_nag_debug/SWMF/lib -lSHARE -default_kinds:r=64  -lstdc++ -C -gline -nan -Wl,-w -Wl=`which gcc` -lgomp

share/Library/test/test_utilities (SWMF_TEST_RESULTS/2020/04/30: grid)

test_utilities starting
/Applications/Xcode.app/Contents/Developer/usr/bin/make /Users/gtoth/Tmp_nag_debug/SWMF/lib/libSHARE.a
make[6]: `/Users/gtoth/Tmp_nag_debug/SWMF/lib/libSHARE.a' is up to date.

/Users/gtoth/Tmp_nag_debug/SWMF/lib/libSHARE.a has been brought up to date.

nagfor -mdir /Users/gtoth/Tmp_nag_debug/SWMF/share/include -I/Users/gtoth/Tmp_nag_debug/SWMF/share/include  -c -w -ideclient -Wc=`which gcc`  -C -gline -nan -default_kinds:r=64 -O0 test_utilities.f90
mpif90 -o test_utilities.exe test_utilities.o \
		-L/Users/gtoth/Tmp_nag_debug/SWMF/lib -lSHARE -default_kinds:r=64  -lstdc++ -C -gline -nan -Wl,-w -Wl=`which gcc` -lgomp 

util/DATAREAD/srcMagnetogram/test_fdips (SWMF_TEST_RESULTS/2020/04/30: grid)

test_fdips_compile...

util/DATAREAD/srcMagnetogram/test_fdips_hypre (SWMF_TEST_RESULTS/2020/04/30: grid)

test_fdips_hypre_compile...

util/DATAREAD/srcMagnetogram/test_fdips_wedge (SWMF_TEST_RESULTS/2020/04/30: grid)

test_fdips_wedge_compile...

util/DATAREAD/srcMagnetogram/test_harmonics (SWMF_TEST_RESULTS/2020/04/30: grid)

test_harmonics_compile...

util/DATAREAD/srcMagnetogram/test_potential (SWMF_TEST_RESULTS/2020/04/30: grid)

test_potential_compile...

BATL/advect11 (SWMF_TEST_RESULTS/2020/04/30: grid)

ERROR in DiffNum.pl: run/advect11.log does not exist

BATL/advect12 (SWMF_TEST_RESULTS/2020/04/30: grid)

ERROR in DiffNum.pl: run/advect12.log does not exist

BATL/advect21 (SWMF_TEST_RESULTS/2020/04/30: grid)

ERROR in DiffNum.pl: run/advect21.log does not exist

BATL/advect22 (SWMF_TEST_RESULTS/2020/04/30: grid)

ERROR in DiffNum.pl: run/advect22.log does not exist

BATL/advect22_cyl (SWMF_TEST_RESULTS/2020/04/30: grid)

ERROR in DiffNum.pl: run/advect22_cyl.log does not exist

BATL/advect22_round (SWMF_TEST_RESULTS/2020/04/30: grid)

ERROR in DiffNum.pl: run/advect22_round.log does not exist

BATL/advect22_rz (SWMF_TEST_RESULTS/2020/04/30: grid)

ERROR in DiffNum.pl: run/advect22_rz.log does not exist

BATL/advect31 (SWMF_TEST_RESULTS/2020/04/30: grid)

ERROR in DiffNum.pl: run/advect31.log does not exist

BATL/advect32 (SWMF_TEST_RESULTS/2020/04/30: grid)

ERROR in DiffNum.pl: run/advect32.log does not exist

BATL/advect33 (SWMF_TEST_RESULTS/2020/04/30: grid)

ERROR in DiffNum.pl: run/advect33.log does not exist

BATL/advect33_rlonlat (SWMF_TEST_RESULTS/2020/04/30: grid)

ERROR in DiffNum.pl: run/advect33_rlonlat.log does not exist

BATL/advect33_round (SWMF_TEST_RESULTS/2020/04/30: grid)

ERROR in DiffNum.pl: run/advect33_round.log does not exist

BATL/advect33_sph (SWMF_TEST_RESULTS/2020/04/30: grid)

ERROR in DiffNum.pl: run/advect33_sph.log does not exist

BATL/readamr_1d (SWMF_TEST_RESULTS/2020/04/30: grid)

WARNING in DiffNum.pl: there are extra numbers in output/readamr_1d.ref

BATL/readamr_2d (SWMF_TEST_RESULTS/2020/04/30: grid)

WARNING in DiffNum.pl: there are extra numbers in output/readamr_2d.ref

BATL/readamr_3d (SWMF_TEST_RESULTS/2020/04/30: grid)

WARNING in DiffNum.pl: there are extra numbers in output/readamr_3d.ref

BATL/readamr_c (SWMF_TEST_RESULTS/2020/04/30: grid)

WARNING in DiffNum.pl: there are extra numbers in output/readamr_c.ref

BATL/readamr_py (SWMF_TEST_RESULTS/2020/04/30: grid)

WARNING in DiffNum.pl: there are extra numbers in output/readamr_py.ref

BATL/readamr_sph (SWMF_TEST_RESULTS/2020/04/30: grid)

WARNING in DiffNum.pl: there are extra numbers in output/readamr_sph.ref

BATL/test11 (SWMF_TEST_RESULTS/2020/04/30: grid)

WARNING in DiffNum.pl: there are extra numbers in output/test11.ref

BATL/test12 (SWMF_TEST_RESULTS/2020/04/30: grid)

WARNING in DiffNum.pl: there are extra numbers in output/test12.ref

BATL/test21 (SWMF_TEST_RESULTS/2020/04/30: grid)

WARNING in DiffNum.pl: there are extra numbers in output/test21.ref

BATL/test22 (SWMF_TEST_RESULTS/2020/04/30: grid)

WARNING in DiffNum.pl: there are extra numbers in output/test22.ref

BATL/test31 (SWMF_TEST_RESULTS/2020/04/30: grid)

WARNING in DiffNum.pl: there are extra numbers in output/test31.ref

BATL/test32 (SWMF_TEST_RESULTS/2020/04/30: grid)

WARNING in DiffNum.pl: there are extra numbers in output/test32.ref

BATL/test33 (SWMF_TEST_RESULTS/2020/04/30: grid)

WARNING in DiffNum.pl: there are extra numbers in output/test33.ref

CZ/FSAM/test_fsam (SWMF_TEST_RESULTS/2020/04/30: grid)

compile...

GM/BATSRUS/test_2bodyplot (SWMF_TEST_RESULTS/2020/04/30: grid)

test_2bodyplot_compile...

GM/BATSRUS/test_anisotropic (SWMF_TEST_RESULTS/2020/04/30: grid)

test_anisotropic_compile...

GM/BATSRUS/test_awsomfluids (SWMF_TEST_RESULTS/2020/04/30: grid)

test_awsomfluids_compile...

GM/BATSRUS/test_chromo (SWMF_TEST_RESULTS/2020/04/30: grid)

test_chromo_compile...

GM/BATSRUS/test_comet (SWMF_TEST_RESULTS/2020/04/30: grid)

test_comet_compile...

GM/BATSRUS/test_cometCGfluids (SWMF_TEST_RESULTS/2020/04/30: grid)

test_cometCGfluids_compile...

GM/BATSRUS/test_cometCGhd (SWMF_TEST_RESULTS/2020/04/30: grid)

test_cometCGhd_compile...

GM/BATSRUS/test_cometfluids (SWMF_TEST_RESULTS/2020/04/30: grid)

test_cometfluids_compile...

GM/BATSRUS/test_cometfluids_restart (SWMF_TEST_RESULTS/2020/04/30: grid)

test_cometfluids_restart_save...

GM/BATSRUS/test_corona (SWMF_TEST_RESULTS/2020/04/30: grid)

test_corona_compile...

GM/BATSRUS/test_coronasph (SWMF_TEST_RESULTS/2020/04/30: grid)

test_coronasph_compile...

GM/BATSRUS/test_earthsph (SWMF_TEST_RESULTS/2020/04/30: grid)

test_earthsph_compile...

GM/BATSRUS/test_eosgodunov (SWMF_TEST_RESULTS/2020/04/30: grid)

test_eosgodunov_compile...

GM/BATSRUS/test_europa2fluidspe (SWMF_TEST_RESULTS/2020/04/30: grid)

test_europa2fluidspe_compile...

GM/BATSRUS/test_europa3fluidspe (SWMF_TEST_RESULTS/2020/04/30: grid)

test_europa3fluidspe_compile...

GM/BATSRUS/test_fivemoment_alfven (SWMF_TEST_RESULTS/2020/04/30: grid)

test_fivemoment_alfven_compile...

GM/BATSRUS/test_fivemoment_langmuir (SWMF_TEST_RESULTS/2020/04/30: grid)

test_fivemoment_langmuir_compile...

GM/BATSRUS/test_fivemoment_shock (SWMF_TEST_RESULTS/2020/04/30: grid)

test_fivemoment_shock_compile...

GM/BATSRUS/test_fluxemergence (SWMF_TEST_RESULTS/2020/04/30: grid)

test_fluxemergence_compile...

GM/BATSRUS/test_func (SWMF_TEST_RESULTS/2020/04/30: grid)

test_func_compile...

GM/BATSRUS/test_ganymede (SWMF_TEST_RESULTS/2020/04/30: grid)

test_ganymede_compile...

GM/BATSRUS/test_graydiffusion (SWMF_TEST_RESULTS/2020/04/30: grid)

test_graydiffusion_compile...

GM/BATSRUS/test_hallmhd (SWMF_TEST_RESULTS/2020/04/30: grid)

test_hallmhd_compile...

GM/BATSRUS/test_laserpackage (SWMF_TEST_RESULTS/2020/04/30: grid)

test_laserpackage_compile...

GM/BATSRUS/test_magnetometer (SWMF_TEST_RESULTS/2020/04/30: grid)

test_magnetometer_compile...

GM/BATSRUS/test_mars (SWMF_TEST_RESULTS/2020/04/30: grid)

test_mars_compile...

GM/BATSRUS/test_mars_restart (SWMF_TEST_RESULTS/2020/04/30: grid)

test_mars_restart_save...

GM/BATSRUS/test_marsfluids (SWMF_TEST_RESULTS/2020/04/30: grid)

test_marsfluids_compile...

GM/BATSRUS/test_marsfluids_restart (SWMF_TEST_RESULTS/2020/04/30: grid)

test_marsfluids_restart_save...

GM/BATSRUS/test_mercurysph (SWMF_TEST_RESULTS/2020/04/30: grid)

test_mercurysph_compile...

GM/BATSRUS/test_mhdions (SWMF_TEST_RESULTS/2020/04/30: grid)

test_mhdions_compile...

GM/BATSRUS/test_mhdnoncons (SWMF_TEST_RESULTS/2020/04/30: grid)

test_mhdnoncons_compile...

GM/BATSRUS/test_multifluid (SWMF_TEST_RESULTS/2020/04/30: grid)

test_multifluid_compile...

GM/BATSRUS/test_multiion (SWMF_TEST_RESULTS/2020/04/30: grid)

test_multiion_compile...

GM/BATSRUS/test_outerhelio (SWMF_TEST_RESULTS/2020/04/30: grid)

test_outerhelio_compile...

GM/BATSRUS/test_outerheliopui (SWMF_TEST_RESULTS/2020/04/30: grid)

test_outerheliopui_compile...

GM/BATSRUS/test_partsteady (SWMF_TEST_RESULTS/2020/04/30: grid)

test_partsteady_compile...

GM/BATSRUS/test_region2d (SWMF_TEST_RESULTS/2020/04/30: grid)

test_region2d_compile...

GM/BATSRUS/test_saturn (SWMF_TEST_RESULTS/2020/04/30: grid)

test_saturn_compile...

GM/BATSRUS/test_shockramp (SWMF_TEST_RESULTS/2020/04/30: grid)

test_shockramp_compile...

GM/BATSRUS/test_shocktube (SWMF_TEST_RESULTS/2020/04/30: grid)

test_shocktube_compile...

GM/BATSRUS/test_titan (SWMF_TEST_RESULTS/2020/04/30: grid)

test_titan_compile...

GM/BATSRUS/test_titan_restart (SWMF_TEST_RESULTS/2020/04/30: grid)

test_titan_restart_save...

GM/BATSRUS/test_twofluidmhd (SWMF_TEST_RESULTS/2020/04/30: grid)

test_twofluidmhd_compile...

GM/BATSRUS/test_venus (SWMF_TEST_RESULTS/2020/04/30: grid)

test_venus_compile...

GM/BATSRUS/test_venus_restart (SWMF_TEST_RESULTS/2020/04/30: grid)

test_venus_restart_save...

GM/BATSRUS/test_viscosity (SWMF_TEST_RESULTS/2020/04/30: grid)

test_viscosity_compile...

IE/Ridley_serial/notest (SWMF_TEST_RESULTS/2020/04/30: grid)

IE/Ridley_serial test is incomplete

IM/CIMI/test_cimi (SWMF_TEST_RESULTS/2020/04/30: grid)

test_compile...

IM/HEIDI/test_analytic (SWMF_TEST_RESULTS/2020/04/30: grid)

test_compile...

IM/HEIDI/test_numeric (SWMF_TEST_RESULTS/2020/04/30: grid)

test_compile...

IM/RCM2/notest (SWMF_TEST_RESULTS/2020/04/30: grid)

There is no test for RCM2

PC/ALTOR/test_altor (SWMF_TEST_RESULTS/2020/04/30: grid)

test_altor_compile...

PC/ALTOR/test_altor_2d (SWMF_TEST_RESULTS/2020/04/30: grid)

test_altor_2d_compile...

PC/ALTOR/test_beam (SWMF_TEST_RESULTS/2020/04/30: grid)

test_beam_compile...

PC/ALTOR/test_foil (SWMF_TEST_RESULTS/2020/04/30: grid)

test_foil_compile...

PC/IPIC3D2/test_ipic3d (SWMF_TEST_RESULTS/2020/04/30: grid)

test_compile...

PS/DGCPM/notest (SWMF_TEST_RESULTS/2020/04/30: grid)

PS/DGCPM test is incomplete

PW/PWOM/test_Earth (SWMF_TEST_RESULTS/2020/04/30: grid)

test_compile...

PW/PWOM/test_Earth_plots (SWMF_TEST_RESULTS/2020/04/30: grid)

starting...

PW/PWOM/test_Earth_restart (SWMF_TEST_RESULTS/2020/04/30: grid)

test_restart_save...

PW/PWOM/test_Saturn (SWMF_TEST_RESULTS/2020/04/30: grid)

test_compile...

PW/PWOM/test_Saturn_plots (SWMF_TEST_RESULTS/2020/04/30: grid)

starting...

PW/PWOM/test_Saturn_restart (SWMF_TEST_RESULTS/2020/04/30: grid)

test_restart_save...

RB/RBE/test (SWMF_TEST_RESULTS/2020/04/30: grid)

test_compile...

SP/Kota/notest (SWMF_TEST_RESULTS/2020/04/30: grid)

SP/Kota test is incomplete

SP/MFLAMPA/test_mflampa (SWMF_TEST_RESULTS/2020/04/30: grid)

test_mflampa_compile...

UA/GITM2/test_gitm_earth_1d (SWMF_TEST_RESULTS/2020/04/30: grid)

test_gitm_earth_1d_compile...

UA/GITM2/test_gitm_mars_1d (SWMF_TEST_RESULTS/2020/04/30: grid)

test_gitm_mars_1d_compile...

test01_gm (SWMF_TEST_RESULTS/2020/04/30: grid)

test1_compile...

test01_ie (SWMF_TEST_RESULTS/2020/04/30: grid)

test1_compile...

test01_pw (SWMF_TEST_RESULTS/2020/04/30: grid)

test1_compile...

test03_gm (SWMF_TEST_RESULTS/2020/04/30: grid)

test3_compile...

test03_ie (SWMF_TEST_RESULTS/2020/04/30: grid)

test3_compile...

test03_im_cimi (SWMF_TEST_RESULTS/2020/04/30: grid)

test3_compile...

test04_gm (SWMF_TEST_RESULTS/2020/04/30: grid)

test4_compile...

test04_ie (SWMF_TEST_RESULTS/2020/04/30: grid)

test4_compile...

test04_im_heidi (SWMF_TEST_RESULTS/2020/04/30: grid)

test4_compile...

test05_ee (SWMF_TEST_RESULTS/2020/04/30: grid)

test5_compile...

test07_ih (SWMF_TEST_RESULTS/2020/04/30: grid)

test7_compile...

test07_oh (SWMF_TEST_RESULTS/2020/04/30: grid)

test7_compile...

test08_ih (SWMF_TEST_RESULTS/2020/04/30: grid)

test8_compile...

test08_sc_thread (SWMF_TEST_RESULTS/2020/04/30: grid)

test8_compile...

test09_ih (SWMF_TEST_RESULTS/2020/04/30: grid)

test9_compile...

test09_sc_chromo (SWMF_TEST_RESULTS/2020/04/30: grid)

test9_compile...

test10_ih (SWMF_TEST_RESULTS/2020/04/30: grid)

test10_compile...

test10_sc (SWMF_TEST_RESULTS/2020/04/30: grid)

test10_compile...

test12_3d_gm (SWMF_TEST_RESULTS/2020/04/30: grid)

test12_3d_compile...

test12_aniso_AMPS_divE_corr_gmpc (SWMF_TEST_RESULTS/2020/04/30: grid)

test12_aniso_AMPS_divE_corr_compile...

test12_aniso_AMPS_dynamic_gmpc (SWMF_TEST_RESULTS/2020/04/30: grid)

test12_aniso_AMPS_dynamic_compile...

test12_aniso_AMPS_gmpc (SWMF_TEST_RESULTS/2020/04/30: grid)

test12_aniso_AMPS_compile...

test12_aniso_AMPS_openmp_gmpc (SWMF_TEST_RESULTS/2020/04/30: grid)

test12_aniso_AMPS_openmp_compile...

test12_aniso_gmpc (SWMF_TEST_RESULTS/2020/04/30: grid)

test12_aniso_compile...

test12_iso_gm (SWMF_TEST_RESULTS/2020/04/30: grid)

test12_iso_compile...

test13_pt (SWMF_TEST_RESULTS/2020/04/30: grid)

test13_compile...

test14_ohpt (SWMF_TEST_RESULTS/2020/04/30: grid)

test14_compile...

test15_scihsp (SWMF_TEST_RESULTS/2020/04/30: grid)

test15_scihsp_compile...

test16 (SWMF_TEST_RESULTS/2020/04/30: grid)

test16_compile...

test17 (SWMF_TEST_RESULTS/2020/04/30: grid)

test17_compile...

test18 (SWMF_TEST_RESULTS/2020/04/30: grid)

test18_compile...

test_ps (SWMF_TEST_RESULTS/2020/04/30: grid)

starting...
test_ps_compile...

test_swpc_cimi_gm (SWMF_TEST_RESULTS/2020/04/30: grid)

test_swpc_cimi_compile...

test_swpc_cimi_ie (SWMF_TEST_RESULTS/2020/04/30: grid)

test_swpc_cimi_compile...

test_swpc_gm (SWMF_TEST_RESULTS/2020/04/30: grid)

test_swpc_compile...

test_swpc_ie (SWMF_TEST_RESULTS/2020/04/30: grid)

test_swpc_compile...

test_swpc_multiion_gm (SWMF_TEST_RESULTS/2020/04/30: grid)

test_swpc_multiion_compile...

test_swpc_multiion_ie (SWMF_TEST_RESULTS/2020/04/30: grid)

test_swpc_multiion_compile...

test_swpc_multispecies_gm (SWMF_TEST_RESULTS/2020/04/30: grid)

test_swpc_multispecies_compile...

test_swpc_multispecies_ie (SWMF_TEST_RESULTS/2020/04/30: grid)

test_swpc_multispecies_compile...

test_swpc_rb (SWMF_TEST_RESULTS/2020/04/30: grid)

test_swpc_compile...
==============================================================